{"text_format":"1","workbook":"xlsx","n_sheets":6,"sheets":["Steam Leak Est rev 8.1","Report Sheet","CO2 Conversion Factors","Steam water pres table May-2009","Explanation--Emission Formula","Total"],"not_rendered":{"charts":0,"images":1,"macros":0,"external_links":0,"defined_names":2,"comments":0,"pivot_tables":0},"unopened":[],"bounds":{"document_bytes":16777216,"sheet_cells":100000,"rows_first":2000,"rows_last":500,"rows_between":2000,"halvings":0,"cell_chars":16384,"cell_head_chars":4096},"cells_cut":0,"cells_raw":0,"read":"whole","date_system":"1900"}

{"sheet":"Steam Leak Est rev 8.1","index":0,"n_rows":111,"n_cols":26,"rows_kept":111,"cut":false,"hidden":false,"merged":[[0,17,0,20],[2,3,2,6],[2,17,2,18],[2,19,3,19],[2,20,3,20],[0,1,0,15],[1,1,1,15],[2,9,5,15],[7,4,7,6],[7,7,7,11],[6,6,6,11],[31,1,31,15],[9,11,9,15],[10,1,10,15],[11,1,11,15],[15,1,15,15],[73,17,73,20],[47,1,47,15],[131,1,131,10],[95,1,95,15],[79,1,79,15],[63,1,63,15],[70,17,70,20],[72,17,72,20]]}
[null,"Inveno Engineering LLC.                              www.Invenoeng.com",null,null,null,null,null,null,null,null,null,null,null,null,null,null,null,"Pipe Diameter Reference"]
[null,"Steam loss can be estimated using the following variant of Napier's formula:"]
[null,null,null,"Steam Loss = 22.88 x Pa X D^2",null,null,null,null,null,"Emissions Factors Used by Save Energy Now Program (CO2/MMBtu Primary), other emissions provided by USA EIA.",null,null,null,null,null,null,null,"Nominal Pipe Size",null,"OD (in)","ID (in)"]
[null,null,null,"22.88 = constant",null,null,null,null,null,null,null,null,null,null,null,null,null,"Size","Schedule"]
[null,null,null,"Pa = Absolute Steam Pressure",null,null,null,null,null,null,null,null,null,null,null,null,null,"1/8","STD",0.40500000000000003,0.26900000000000002]
[null,null,null,"D = Diameter of leak",null,null,null,null,null,null,null,null,null,null,null,null,null,null,"XS",null,0.215]
[null,null,null,"Cost of Steam ",2.5,"$/1000lbs"," Add the steam cost per thousand lbs of steam"]
[null,null,null,"Fuel type","Natural Gas",null,null,"Drop down window for fuel selections",null,null,null,null,null,null,null,null,null,"1/4","STD",0.54,0.36399999999999999]
[]
[]
[null,"Quick Calculation - User defined ",null,null,null,null,null,null,null,null,null,null,null,null,null,null,null,null,"XS",null,0.30199999999999999]
[null,"CELLS THAT CAN BE MODIFY",null,null,null,null,null,null,null,null,null,null,null,null,null,null,null,"3/8","STD",0.67500000000000004,0.49299999999999999]
[null,"Pressure",null,"Abs Pressure","Constant","Diameter","D^2","Steam Loss (pph)","Cost / Hour","Days / Year","Cost / Year","CO2 Emissions / Year","NOX","SO2","Particulates","Mercury",null,null,"XS",null,0.42299999999999999]
[null,150,null,{"$f":"B14+14.696","v":164.696},22.88,0.5,{"$f":"F14^2","v":0.25},{"$f":"D14*E14*G14","v":942.06111999999996},{"$f":"(H14/1000)*E7","v":2.3551527999999999},350,{"$f":"I14*24*J14","v":19783.283520000001},{"$f":"((((VLOOKUP($B14,'Steam water pres table May-2009'!$B$4:$I$240,8,FALSE)*$H14)/1000000)*(VLOOKUP($E$8,'CO2 Conversion Factors'!$A$3:$G$23,3,FALSE)))*24)*$J14","v":1107230.5461600292},{"$f":"((((VLOOKUP($B14,'Steam water pres table May-2009'!$B$4:$I$240,8,FALSE)*$H14)/1000000)*(VLOOKUP($E$8,'CO2 Conversion Factors'!$A$3:$G$23,4,FALSE)))*24)*$J14","v":870.04791806220283},{"$f":"((((VLOOKUP($B14,'Steam water pres table May-2009'!$B$4:$I$240,8,FALSE)*$H14)/1000000)*(VLOOKUP($E$8,'CO2 Conversion Factors'!$A$3:$G$23,5,FALSE)))*24)*$J14","v":9457.042587632639},{"$f":"((((VLOOKUP($B14,'Steam water pres table May-2009'!$B$4:$I$240,8,FALSE)*$H14)/1000000)*(VLOOKUP($E$8,'CO2 Conversion Factors'!$A$3:$G$23,6,FALSE)))*24)*$J14","v":66199.298113428464},{"$f":"((((VLOOKUP($B14,'Steam water pres table May-2009'!$B$4:$I$240,8,FALSE)*$H14)/1000000)*(VLOOKUP($E$8,'CO2 Conversion Factors'!$A$3:$G$23,7,FALSE)))*24)*$J14","v":0},null,"1/2","STD",0.84,0.622]
[null,null,null,null,null,null,null,null,null,null,null,null,null,null,null,null,null,null,"XS",null,0.54600000000000004]
[null,"1/16\" Leak",null,null,null,null,null,null,null,null,null,null,null,null,null,null,null,null,"XXS",null,0.252]
[null,"Pressure","Bar","Abs Pressure","Constant","Diameter","D^2","Steam Loss (pph)","Cost / Hour","Days / Year","Cost / Year","CO2 Emissions / Year","NOX","SO2","Particulates","Mercury",null,"3/4","STD",1.05,0.82399999999999995]
[null,5,null,{"$f":"B18+14.696","v":19.695999999999998},22.88,{"$f":"1/16","v":6.25E-2},{"$f":"F18^2","v":3.90625E-3},{"$f":"D18*E18*G18","v":1.7603299999999997},{"$f":"(H18/1000)*E$7","v":4.4008249999999988E-3},365,{"$f":"I18*24*J18","v":38.55122699999999},{"$f":"((((VLOOKUP($B18,'Steam water pres table May-2009'!$B$4:$I$240,8,FALSE)*$H18)/1000000)*(VLOOKUP($E$8,'CO2 Conversion Factors'!$A$3:$G$23,3,FALSE)))*24)*$J18","v":2087.276906087699},{"$f":"((((VLOOKUP($B18,'Steam water pres table May-2009'!$B$4:$I$240,8,FALSE)*$H18)/1000000)*(VLOOKUP($E$8,'CO2 Conversion Factors'!$A$3:$G$23,4,FALSE)))*24)*$J18","v":1.640156092928496},{"$f":"((((VLOOKUP($B18,'Steam water pres table May-2009'!$B$4:$I$240,8,FALSE)*$H18)/1000000)*(VLOOKUP($E$8,'CO2 Conversion Factors'!$A$3:$G$23,5,FALSE)))*24)*$J18","v":17.827783618788001},{"$f":"((((VLOOKUP($B18,'Steam water pres table May-2009'!$B$4:$I$240,8,FALSE)*$H18)/1000000)*(VLOOKUP($E$8,'CO2 Conversion Factors'!$A$3:$G$23,6,FALSE)))*24)*$J18","v":124.79448533151601},{"$f":"((((VLOOKUP($B18,'Steam water pres table May-2009'!$B$4:$I$240,8,FALSE)*$H18)/1000000)*(VLOOKUP($E$8,'CO2 Conversion Factors'!$A$3:$G$23,7,FALSE)))*24)*$J18","v":0},null,null,"XS",null,0.74199999999999999,null,null,null,0.01,16897]
[null,15,null,29.695999999999998,22.88,6.25E-2,{"$f":"F19^2","v":3.90625E-3},2.6540799999999996,6.6351999999999991E-3,365,58.124351999999988,{"$f":"((((VLOOKUP($B19,'Steam water pres table May-2009'!$B$4:$I$240,8,FALSE)*$H19)/1000000)*(VLOOKUP($E$8,'CO2 Conversion Factors'!$A$3:$G$23,3,FALSE)))*24)*$J19","v":3168.9634694746824},{"$f":"((((VLOOKUP($B19,'Steam water pres table May-2009'!$B$4:$I$240,8,FALSE)*$H19)/1000000)*(VLOOKUP($E$8,'CO2 Conversion Factors'!$A$3:$G$23,4,FALSE)))*24)*$J19","v":2.4901318687365119},{"$f":"((((VLOOKUP($B19,'Steam water pres table May-2009'!$B$4:$I$240,8,FALSE)*$H19)/1000000)*(VLOOKUP($E$8,'CO2 Conversion Factors'!$A$3:$G$23,5,FALSE)))*24)*$J19","v":27.066650747135999},{"$f":"((((VLOOKUP($B19,'Steam water pres table May-2009'!$B$4:$I$240,8,FALSE)*$H19)/1000000)*(VLOOKUP($E$8,'CO2 Conversion Factors'!$A$3:$G$23,6,FALSE)))*24)*$J19","v":189.46655522995201},{"$f":"((((VLOOKUP($B19,'Steam water pres table May-2009'!$B$4:$I$240,8,FALSE)*$H19)/1000000)*(VLOOKUP($E$8,'CO2 Conversion Factors'!$A$3:$G$23,7,FALSE)))*24)*$J19","v":0},null,null,"XXS",null,0.434,null,null,{"$f":"F19","v":6.25E-2},{"$f":"(X19+X21)/2","v":9.375E-2},{"$f":"L21","v":4802.5649848841795}]
[null,25,null,39.695999999999998,22.88,6.25E-2,3.90625E-3,{"$f":"D20*E20*G20","v":3.5478299999999998},{"$f":"(H20/1000)*E$7","v":8.8695749999999993E-3},365,{"$f":"I20*24*J20","v":77.697476999999992},{"$f":"((((VLOOKUP($B20,'Steam water pres table May-2009'!$B$4:$I$240,8,FALSE)*$H20)/1000000)*(VLOOKUP($E$8,'CO2 Conversion Factors'!$A$3:$G$23,3,FALSE)))*24)*$J20","v":4256.8390094793076},{"$f":"((((VLOOKUP($B20,'Steam water pres table May-2009'!$B$4:$I$240,8,FALSE)*$H20)/1000000)*(VLOOKUP($E$8,'CO2 Conversion Factors'!$A$3:$G$23,4,FALSE)))*24)*$J20","v":3.3449708649820322},{"$f":"((((VLOOKUP($B20,'Steam water pres table May-2009'!$B$4:$I$240,8,FALSE)*$H20)/1000000)*(VLOOKUP($E$8,'CO2 Conversion Factors'!$A$3:$G$23,5,FALSE)))*24)*$J20","v":36.358378967196003},{"$f":"((((VLOOKUP($B20,'Steam water pres table May-2009'!$B$4:$I$240,8,FALSE)*$H20)/1000000)*(VLOOKUP($E$8,'CO2 Conversion Factors'!$A$3:$G$23,6,FALSE)))*24)*$J20","v":254.50865277037201},{"$f":"((((VLOOKUP($B20,'Steam water pres table May-2009'!$B$4:$I$240,8,FALSE)*$H20)/1000000)*(VLOOKUP($E$8,'CO2 Conversion Factors'!$A$3:$G$23,7,FALSE)))*24)*$J20","v":0}]
{"$rows_left_out":92}
{"sheet":"Report Sheet","index":1,"n_rows":19,"n_cols":10,"rows_kept":19,"cut":false,"hidden":false,"merged":[[18,2,18,6],[5,2,5,6],[3,2,3,6],[4,5,4,6],[6,5,6,6],[7,5,7,6],[14,5,14,6],[15,5,15,6],[17,5,17,6],[8,5,8,6],[9,5,9,6],[10,5,10,6],[11,5,11,6],[12,5,12,6],[13,5,13,6]]}
[]
[]
[]
[null,null,"Steam Leakage Summary Sheet"]
[null,null,null,null,null,"Notes"]
[null,null,"Steam Loss = 22.88 x Pa X D^2 - Equation used for the steam leaks"]
[null,null,"Cost of steam",9,"Per Thousand Lbs"]
[null,null,"Estimated number of Leaks",82]
[null,null,"Average size of the leak",0.1]
[null,null,"Psia",189,"13.01 bara"]
[null,null,"Flow in lbs. per hour",{"$f":"(22.88*D10*D9^2*D8)","v":3545.9424000000008},null,null,null,null,null,{"$f":"(D11*8760)","v":31062455.424000006}]
[null,null,"Conversion lb to Tonne",2204]
[null,null,"Steam loss flow in Tonne",{"$f":"(D11/D12)","v":1.6088667876588025},"Tonne"]
[null,null,"Cost per hour",{"$f":"(D13*D7)","v":14.479801088929223},null,null,null,null,null,31062]
[null,null,"Cost per year",{"$f":"(D14*8760)","v":126843.05753902},null,null,null,null,null,4.5]
[null,null,"Emissions Natural Gas",9.1999999999999998E-2,"Per mmbtu"]
[null,null,"C02 per year (lbs)",{"$f":"(J11*D16)","v":2857745.8990080007},"lbs per year"]
[null,null,"CO2 per year (Tonne)",{"$f":"(D17/2204)","v":1296.6179215099821},"Ton per year",null,null,null,null,{"$f":"(J14*J15)","v":139779}]
[null,null,"Copy Rights: Not to be copied or distributed without specific permission from Inveno Engineering LLC; kelly.paffel@invenoeng.com"]

{"sheet":"CO2 Conversion Factors","index":2,"n_rows":34,"n_cols":7,"rows_kept":34,"cut":false,"hidden":false,"merged":[]}
["Proposed CO2 Conversion Factors for Primary Energy Savings under SEN Program"]
["Fuel Type","CO2 Emissions Factors Used by Save Energy Now Program (CO2/MMBtu Primary)","Conversion Factor","NOX","SO2","Particlulates","Mercury"]
["Black Liquor","221.605 lbs CO2/MMBtu",221.60499999999999]
["Blast Furnace Gas","604.589 lbs CO2/MMBtu",604.58900000000006]
["Butane","141.801 lbs CO2/MMBtu",141.80099999999999]
["Butene","141.801 lbs CO2/MMBtu",141.80099999999999]
["Coal","215.2 lbs CO2/MMBtu",215.2,457,2591,2744,1.6E-2]
["Coke","225.130 lbs CO2/MMBtu",225.13]
["Coke Oven Gas","103.245 lbs CO2/MMBtu",103.245]
["Crude Petroleum","170.447 lbs CO2/MMBtu",170.447]
["Distillate Fuel (Light Fuel Oil)","161.386 lbs CO2/MMBtu",161.386]
["Electricity (purchased)","127.56 lbs CO2/MMBtu",127.56]
["Ethane","130.029 lbs CO2/MMBtu",130.029]
["Gasoline","156.425 lbs CO2/MMBtu",156.42500000000001]
["Isobutane","142.044 lbs CO2/MMBtu",142.04400000000001]
["Kerosene","159.535 lbs CO2/MMBtu",159.535]
["Liquefied Petroleum Gas (LPG)","139.039 lbs CO2/MMBtu",139.03899999999999]
["Methane / Landfill Gas","115.258 lbs CO2/MMBtu",115.258]
["Municipal refuse (Dry)","145.877 lbs CO2/MMBtu",145.87700000000001]
["Natural Gas","117.080 lbs CO2/MMBtu",117.08,9.1999999999999998E-2,1,7,0]
{"$rows_left_out":15}
{"sheet":"Steam water pres table May-2009","index":3,"n_rows":240,"n_cols":9,"rows_kept":240,"cut":false,"hidden":false,"merged":[[1,1,1,2],[1,4,1,5],[1,7,1,8],[46,1,46,2],[46,4,46,5],[46,7,46,8],[91,1,91,2],[91,4,91,5],[91,7,91,8],[136,1,136,2],[136,4,136,5],[136,7,136,8],[181,1,181,2],[181,4,181,5],[181,7,181,8],[226,1,226,2],[226,4,226,5],[226,7,226,8]]}
[null,"Step 1",null,null,null,null,null,null,"Step 2"]
[null,"Pressure",null,"Temperature","Specific Volume",null,"Heat -BTU/lb","Enthalpy - BTU/lb"]
[null,"Gage psig","Absolute psia","Saturation Deg. F.","Water vf\nft3/lb","Steam vg\nft3/lb","Liquid hf","Lat. Heat    hfg","Total STM Heat hg"]
[null,0,14.7,212,1.6712999999999999E-2,26.789000000000001,180.33,970,{"$f":"SUM(G4:H4)","v":1150.33}]
[null,1,15.7,215.34,1.6737999999999999E-2,25.190999999999999,183.7,967.9,{"$f":"SUM(G5:H5)","v":1151.5999999999999}]
[null,2,16.7,218.51,1.6761000000000002E-2,23.779,186.89,966,{"$f":"SUM(G6:H6)","v":1152.8899999999999}]
[null,3,17.7,221.53,1.6784E-2,22.521999999999998,189.93,964.1,{"$f":"SUM(G7:H7)","v":1154.03}]
[null,4,18.7,224.4,1.6806000000000001E-2,21.393999999999998,192.83,962.3,1155.1299999999999]
[null,5,19.7,227.15,1.6827000000000002E-2,20.378,195.61,960.5,1156.1100000000001]
[null,6,20.7,229.79,1.6847999999999998E-2,19.456,198.28,958.8,1157.08]
[null,7,21.7,232.33,1.6867E-2,18.617000000000001,200.84,957.2,1158.04]
[null,8,22.7,234.77,1.6886000000000002E-2,17.849,203.31,955.6,1158.9100000000001]
[null,9,23.7,237.13,1.6905E-2,17.143999999999998,205.69,954.1,1159.79]
[null,10,24.7,239.4,1.6923000000000001E-2,16.494,207.99,952.6,1160.5900000000001]
[null,11,25.7,241.6,1.6941000000000001E-2,15.891999999999999,210.21,951.2,1161.4100000000001]
[null,12,26.7,243.74,1.6958000000000001E-2,15.335000000000001,212.37,949.8,1162.0999999999999]
[null,13,27.7,245.8,1.6974E-2,14.816000000000001,214.46,948.4,1162.8]
[null,14,28.7,247.81,1.6990999999999999E-2,14.332000000000001,216.5,947,1163.5]
[null,15,29.7,249.76,1.7006E-2,13.88,218.47,945.7,1164.17]
[null,16,30.7,251.66,1.7021999999999999E-2,13.456,220.4,944.5,1164.9000000000001]
{"$rows_left_out":221}
{"sheet":"Explanation--Emission Formula","index":4,"n_rows":34,"n_cols":1,"rows_kept":34,"cut":false,"hidden":false,"merged":[]}
["This formula is from Steam Leak Est rev 4 2 tab - Column K"]
["=(((VLOOKUP($B12,'Steam water pres table May-2009'!$B$4:$I$240,8,FALSE)*$G12)/1000000)*(VLOOKUP($D$8,'CO2 Conversion Factors'!$A$3:$C$23,3,FALSE))*24)*I12"]
[]
["Part 1"]
["=((VLOOKUP($B12,'Steam water pres table May-2009'!$B$4:$I$240,8,FALSE)*$G12)/1000000)"]
["$B12 is the Pressure in column \"B\" found on Steam Leak Est rev 4 2 tab"]
["$G12 is the Steam Loss (pph) found on Steam Leak Est rev 4 2 tab"]
["Based on the pressure of the specific row, VLOOKUP finds the match on the Steam water pres table May-2009 tab in column \"B\" and uses the \"Total STM Heat hg\" data in column \"I\".  The \"Total STM Heat hg\" is then multiplied by the Steam Loss (pph).  This number is then divided by 1,000,000."]
[]
["Part 2"]
["=VLOOKUP($D$8,'CO2 Conversion Factors'!$A$3:$C$23,3,FALSE)"]
["$D$8 is the drop down box for the fuel type"]
["Based on the Fuel type picked in $D$8, VLOOKUP finds the match on the CO2 Conversion Factors tab in column \"A\" and uses the \"Conversion Factor\" in column \"C\" "]
["This Conversion Factor changes based on the fuel type."]
[]
["Part 3"]
["(PART 1 * PART 2)*24)*I12"]
["The original formula (Part 1 multiplied by Part 2) is multiplied by 24 to represent 1 day.  This number is then multiplied by the Days / Year (column \"I\") for that specific pressure ($B$12)"]
[]
[]
{"$rows_left_out":15}
{"sheet":"Total","index":5,"n_rows":0,"n_cols":0,"rows_kept":0,"cut":false,"hidden":false,"merged":[]}