{"text_format":"1","workbook":"xlsx","n_sheets":7,"sheets":["Main","Blank for Calculation","Excess Air","Fuel","Combustion","Units","Steam Table"],"not_rendered":{"charts":0,"images":1,"macros":1,"external_links":0,"defined_names":190,"comments":2,"pivot_tables":0},"unopened":[],"bounds":{"document_bytes":16777216,"sheet_cells":100000,"rows_first":2000,"rows_last":500,"rows_between":2000,"halvings":0,"cell_chars":16384,"cell_head_chars":4096},"cells_cut":0,"cells_raw":0,"read":"whole","date_system":"1900"}

{"sheet":"Main","index":0,"n_rows":138,"n_cols":31,"rows_kept":138,"cut":false,"hidden":false,"merged":[[5,3,5,6],[6,3,6,6],[7,3,7,6],[1,1,1,11],[16,13,17,13],[16,5,16,6],[16,7,16,8],[8,3,8,6],[3,9,3,10],[6,9,6,11],[7,9,7,11],[8,9,8,11],[3,3,3,6],[4,3,4,6],[119,5,120,6],[119,7,120,7],[32,13,32,25],[30,7,31,11],[9,26,9,27],[16,14,17,14],[16,18,16,24],[16,15,17,15],[16,16,17,16],[16,17,17,17]]}
[]
[null,"BOILER EFFICIENCY CALCULATION \n(PER ASME PTC 4)"]
[]
[null,"Client:",null,"Sample company",null,null,null,null,"Date:","2017-05-30",null,null,null,null,"Selection Basis"]
[null,"Plant Location:",null,"Sample location",null,null,null,null,null,null,null,null,null,null,"Unit Preference",1,"1: English 2: Metric"]
[null,null,null,"WI",null,null,null,null,null,null,null,null,null,null,"Moisture Measurement Basis",1,"1: Wet-bulb 2: Relative Humidity"]
[null,"Contact Person:",null,"XXXXX",null,null,null,null,"Engineer:","Kelly Paffel",null,null,null,null,"Flue Gas Measurement Basis",1,"1: Dry 2: Wet",null,null,null,null,null,null,null,null,null,null,null,null,"Unit Conversion: 1 English unit to SI unit"]
[null,"Email:",null,null,null,null,null,null,"Email:","Kelly.paffel@invenoeng.com",null,null,null,null,"Type of Gas Measured in Flue",1,"1: Oxygen 2: Carbon Dioxide",null,null,null,null,null,null,null,null,null,"Previous Units:",2,null,0.45359237000000002,"kg"]
[null,"Contact Number:",null,null,null,null,null,null,"Contact No.:","239-289-3667",null,null,null,null,"Unit for Carbon Monoxide",1,"1: ppm 2: % Vol",null,null,null,null,null,null,null,null,null,1,2,null,0.30480000000000002,"m"]
[null,null,null,null,null,null,null,null,null,null,null,null,null,null,"Ash Residue",2,"1: Yes 2: No",null,null,null,null,null,null,null,null,null,"For Unit Conversion",null,null,6.8947572930000006E-2,"bara"]
[null,"Fuel Data",null,null,null,null,null,null,null,null,null,null,null,null,"Fuel Type",8,{"$f":"\"1: \"&Fuel!B4 & \" 2: \"&Fuel!B5 & \" 3: \"&Fuel!B6 & \" 4: \"&Fuel!B7 & \" 5: \"&Fuel!B8 & \" 6: \"&Fuel!B9 & \" 7: \"&Fuel!B10 & \" 8: \"&Fuel!B11 & \" 9: \"& \"Blank\"","v":"1: Coal 2: Diesel 3: Fuel No.2 4: Fuel No.6 5: Gasoline 6: Heavy Fuel oil 7: Kerosene 8: Natural Gas 9: Blank"},null,null,null,null,null,null,null,null,null,"English","Metric",null,1.055055853,"kJ"]
[null,null,"Fuel Type:",null,null,null,null,null,null,null,null,{"$f":"IF(Fuel_Type=9,\"¬\",\"\")","v":""}]
[null,null,"Fuel Input:",null,null,11000,{"$f":"IF(Units_Pref=1,\"lb/h\",\"kg/h\")","v":"lb/h"},null,null,null,null,{"$f":"IF(ISBLANK(F13),\"¬\",\"\")","v":""},null,null,null,null,null,"Mass % (Ultimate Analysis):",{"$f":"IF(SUM($S$14:$Y$14)=0,0,S14/SUM($S$14:$Y$14)*100)","v":66.943853979732154},{"$f":"IF(SUM($S$14:$Y$14)=0,0,T14/SUM($S$14:$Y$14)*100)","v":21.136484538653917},0,0,0,0,11.919661481613923,null,{"$f":"IF(Units_Pref=AA$9,$F13,$F13/Unit_Preference_Mass)","v":11000},{"$f":"IF(Units_Pref=AB$9,$F13,$F13*Unit_Preference_Mass_SI)","v":4989.5160700000006}]
[null,null,"Fuel High Heating Value (HHV):",null,null,14100,{"$f":"IF(Units_Pref=1,\"Btu/lb\",\"kJ/kg\")","v":"Btu/lb"},"- by lab GC analysis",null,null,null,{"$f":"IF(ISBLANK(F14),\"¬\",\"\")","v":""},null,null,null,null,null,"Mass:",{"$f":"S15*S16","v":1213.1109999999999},{"$f":"T15*T16","v":383.02099999999996},0,0,0,0,216,null,{"$f":"IF(Units_Pref=AA$9,$F14,$F14*Unit_Preference_Mass/Unit_Preference_Energy)","v":14100},{"$f":"IF(Units_Pref=AB$9,$F14,$F14*Unit_Preference_Energy_SI/Unit_Preference_Mass_SI)","v":32796.60001181237}]
[null,null,"Unburned Carbon Loss:",null,null,0.4,"% of Fuel Input",null,null,null,null,{"$f":"IF(ISBLANK(F15),\"¬\",\"\")","v":""},null,null,null,null,null,"Moles:",{"$f":"SUMPRODUCT($P$19:$P$28,S19:S28)","v":101},{"$f":"SUMPRODUCT($P$19:$P$28,T19:T28)","v":190},0,0,0,0,6]
[null,null,null,null,null,null,null,null,null,null,null,null,null,null,null,{"$f":"SUM(P19:P28)","v":100},null,"M.W:",{"$f":"IF(S18>0,VLOOKUP(S18,Combustion!$C$7:$AG$41,2,FALSE),\"\")","v":12.010999999999999},{"$f":"IF(T18>0,VLOOKUP(T18,Combustion!$C$7:$AG$41,2,FALSE),\"\")","v":2.0158999999999998},{"$f":"IF(U18>0,VLOOKUP(U18,Combustion!$C$7:$AG$41,2,FALSE),\"\")","v":32.066000000000003},{"$f":"IF(V18>0,VLOOKUP(V18,Combustion!$C$7:$AG$41,2,FALSE),\"\")","v":31.998799999999999},{"$f":"IF(W18>0,VLOOKUP(W18,Combustion!$C$7:$AG$41,2,FALSE),\"\")","v":28.013400000000001},{"$f":"IF(X18>0,VLOOKUP(X18,Combustion!$C$7:$AG$41,2,FALSE),\"\")","v":18.0153},{"$f":"IF(Y18>0,VLOOKUP(Y18,Combustion!$C$7:$AG$41,2,FALSE),\"\")","v":36}]
[null,null,"Ultimate Analysis",null,null,{"$f":"IF(Units_Pref=1,\"Theo. Air lb/ 100 lb Fuel\",\"Theo. Air kg/ 100 kg Fuel\")","v":"Theo. Air lb/ 100 lb Fuel"},null,{"$f":"IF(Units_Pref=1,\"H2O lb/ 100 lb Fuel\",\"H2O kg/ 100 kg Fuel\")","v":"H2O lb/ 100 lb Fuel"},null,null,null,null,null,"No.","Compound","Vol%","Chem. Formula","M.W","Elemental Breakdown"]
[null,null,"Constituent","M.W","Mass %","Constant","Amount","Constant","Amount",null,null,null,null,null,null,null,null,null,"C","H2","S","O2","N2","H2O","Ash"]
[null,null,"C",{"$f":"VLOOKUP(C19,Combustion!$C$7:$D$39,2,FALSE)","v":12.010999999999999},80.31,{"$f":"1*Combustion!$D$40/Combustion!$AD$40/D19","v":11.512132529649152},{"$f":"E19*F19","v":924.5393634561234},null,null,null,null,{"$f":"IF(ISBLANK(E19),\"¬\",\"\")","v":""},null,"N19","Methane",90,{"$f":"IF($O19>0,VLOOKUP($O19,Combustion!$B$7:$AG$41,2,FALSE),\"\")","v":"CH4"},{"$f":"IF($O19>0,VLOOKUP($O19,Combustion!$B$7:$AG$41,3,FALSE),\"\")","v":16.0428},{"$f":"IF($O19>0,VLOOKUP($O19,Combustion!$B$7:$AG$41,26,FALSE),\"\")","v":1},{"$f":"IF($O19>0,VLOOKUP($O19,Combustion!$B$7:$AG$41,27,FALSE),\"\")","v":2},{"$f":"IF($O19>0,VLOOKUP($O19,Combustion!$B$7:$AG$41,28,FALSE),\"\")","v":0},{"$f":"IF($O19>0,VLOOKUP($O19,Combustion!$B$7:$AG$41,29,FALSE),\"\")","v":0},{"$f":"IF($O19>0,VLOOKUP($O19,Combustion!$B$7:$AG$41,30,FALSE),\"\")","v":0},{"$f":"IF($O19>0,VLOOKUP($O19,Combustion!$B$7:$AG$41,31,FALSE),\"\")","v":0},{"$f":"IF($O19>0,VLOOKUP($O19,Combustion!$B$7:$AG$41,32,FALSE),\"\")","v":0}]
[null,null,"H2",{"$f":"VLOOKUP(C20,Combustion!$C$7:$D$39,2,FALSE)","v":2.0158999999999998},4.47,{"$f":"0.5*Combustion!$D$40/Combustion!$AD$40/D20","v":34.295407464064681},{"$f":"E20*F20","v":153.30047136436912},{"$f":"1/D20*Combustion!$D$39","v":8.9366039982141974},{"$f":"H20*E20","v":39.946619872017457},null,null,"",null,"N20","Propane",2,{"$f":"IF($O20>0,VLOOKUP($O20,Combustion!$B$7:$AG$41,2,FALSE),\"\")","v":"C3H8"},{"$f":"IF($O20>0,VLOOKUP($O20,Combustion!$B$7:$AG$41,3,FALSE),\"\")","v":44.096600000000002},{"$f":"IF($O20>0,VLOOKUP($O20,Combustion!$B$7:$AG$41,26,FALSE),\"\")","v":3},{"$f":"IF($O20>0,VLOOKUP($O20,Combustion!$B$7:$AG$41,27,FALSE),\"\")","v":4},{"$f":"IF($O20>0,VLOOKUP($O20,Combustion!$B$7:$AG$41,28,FALSE),\"\")","v":0},{"$f":"IF($O20>0,VLOOKUP($O20,Combustion!$B$7:$AG$41,29,FALSE),\"\")","v":0},{"$f":"IF($O20>0,VLOOKUP($O20,Combustion!$B$7:$AG$41,30,FALSE),\"\")","v":0},{"$f":"IF($O20>0,VLOOKUP($O20,Combustion!$B$7:$AG$41,31,FALSE),\"\")","v":0},{"$f":"IF($O20>0,VLOOKUP($O20,Combustion!$B$7:$AG$41,32,FALSE),\"\")","v":0}]
[null,null,"S",{"$f":"VLOOKUP(C21,Combustion!$C$7:$D$39,2,FALSE)","v":32.066000000000003},1.54,{"$f":"1*Combustion!$D$40/Combustion!$AD$40/D21","v":4.3121132605755612},{"$f":"E21*F21","v":6.6406544212863645},null,null,null,null,"",null,"N21","Ash",6,{"$f":"IF($O21>0,VLOOKUP($O21,Combustion!$B$7:$AG$41,2,FALSE),\"\")","v":"Ash"},{"$f":"IF($O21>0,VLOOKUP($O21,Combustion!$B$7:$AG$41,3,FALSE),\"\")","v":36},{"$f":"IF($O21>0,VLOOKUP($O21,Combustion!$B$7:$AG$41,26,FALSE),\"\")","v":0},{"$f":"IF($O21>0,VLOOKUP($O21,Combustion!$B$7:$AG$41,27,FALSE),\"\")","v":0},{"$f":"IF($O21>0,VLOOKUP($O21,Combustion!$B$7:$AG$41,28,FALSE),\"\")","v":0},{"$f":"IF($O21>0,VLOOKUP($O21,Combustion!$B$7:$AG$41,29,FALSE),\"\")","v":0},{"$f":"IF($O21>0,VLOOKUP($O21,Combustion!$B$7:$AG$41,30,FALSE),\"\")","v":0},{"$f":"IF($O21>0,VLOOKUP($O21,Combustion!$B$7:$AG$41,31,FALSE),\"\")","v":0},{"$f":"IF($O21>0,VLOOKUP($O21,Combustion!$B$7:$AG$41,32,FALSE),\"\")","v":1}]
[null,null,"O2",{"$f":"VLOOKUP(C22,Combustion!$C$7:$D$39,2,FALSE)","v":31.998799999999999},2.85,{"$f":"-1*Combustion!$D$40/Combustion!$AD$40/D22","v":-4.3211690380144248},{"$f":"E22*F22","v":-12.315331758341111},null,null,null,null,"",null,"N22","Carbon",1.5,{"$f":"IF($O22>0,VLOOKUP($O22,Combustion!$B$7:$AG$41,2,FALSE),\"\")","v":"C"},{"$f":"IF($O22>0,VLOOKUP($O22,Combustion!$B$7:$AG$41,3,FALSE),\"\")","v":12.010999999999999},{"$f":"IF($O22>0,VLOOKUP($O22,Combustion!$B$7:$AG$41,26,FALSE),\"\")","v":1},{"$f":"IF($O22>0,VLOOKUP($O22,Combustion!$B$7:$AG$41,27,FALSE),\"\")","v":0},{"$f":"IF($O22>0,VLOOKUP($O22,Combustion!$B$7:$AG$41,28,FALSE),\"\")","v":0},{"$f":"IF($O22>0,VLOOKUP($O22,Combustion!$B$7:$AG$41,29,FALSE),\"\")","v":0},{"$f":"IF($O22>0,VLOOKUP($O22,Combustion!$B$7:$AG$41,30,FALSE),\"\")","v":0},{"$f":"IF($O22>0,VLOOKUP($O22,Combustion!$B$7:$AG$41,31,FALSE),\"\")","v":0},{"$f":"IF($O22>0,VLOOKUP($O22,Combustion!$B$7:$AG$41,32,FALSE),\"\")","v":0}]
[null,null,"N2",{"$f":"VLOOKUP(C23,Combustion!$C$7:$D$39,2,FALSE)","v":28.013400000000001},1.27,null,null,null,null,null,null,"",null,"N23","Toluene",0.5,{"$f":"IF($O23>0,VLOOKUP($O23,Combustion!$B$7:$AG$41,2,FALSE),\"\")","v":"C7H8"},{"$f":"IF($O23>0,VLOOKUP($O23,Combustion!$B$7:$AG$41,3,FALSE),\"\")","v":92.140600000000006},{"$f":"IF($O23>0,VLOOKUP($O23,Combustion!$B$7:$AG$41,26,FALSE),\"\")","v":7},{"$f":"IF($O23>0,VLOOKUP($O23,Combustion!$B$7:$AG$41,27,FALSE),\"\")","v":4},{"$f":"IF($O23>0,VLOOKUP($O23,Combustion!$B$7:$AG$41,28,FALSE),\"\")","v":0},{"$f":"IF($O23>0,VLOOKUP($O23,Combustion!$B$7:$AG$41,29,FALSE),\"\")","v":0},{"$f":"IF($O23>0,VLOOKUP($O23,Combustion!$B$7:$AG$41,30,FALSE),\"\")","v":0},{"$f":"IF($O23>0,VLOOKUP($O23,Combustion!$B$7:$AG$41,31,FALSE),\"\")","v":0},{"$f":"IF($O23>0,VLOOKUP($O23,Combustion!$B$7:$AG$41,32,FALSE),\"\")","v":0}]
[null,null,"H2O",{"$f":"VLOOKUP(C24,Combustion!$C$7:$D$39,2,FALSE)","v":18.0153},3.01,null,null,{"$f":"1/D24*Combustion!$D$39","v":1},{"$f":"H24*E24","v":3.01},null,null,"",null,"N24",null,null,{"$f":"IF($O24>0,VLOOKUP($O24,Combustion!$B$7:$AG$41,2,FALSE),\"\")","v":""},{"$f":"IF($O24>0,VLOOKUP($O24,Combustion!$B$7:$AG$41,3,FALSE),\"\")","v":""},{"$f":"IF($O24>0,VLOOKUP($O24,Combustion!$B$7:$AG$41,26,FALSE),\"\")","v":""},{"$f":"IF($O24>0,VLOOKUP($O24,Combustion!$B$7:$AG$41,27,FALSE),\"\")","v":""},{"$f":"IF($O24>0,VLOOKUP($O24,Combustion!$B$7:$AG$41,28,FALSE),\"\")","v":""},{"$f":"IF($O24>0,VLOOKUP($O24,Combustion!$B$7:$AG$41,29,FALSE),\"\")","v":""},{"$f":"IF($O24>0,VLOOKUP($O24,Combustion!$B$7:$AG$41,30,FALSE),\"\")","v":""},{"$f":"IF($O24>0,VLOOKUP($O24,Combustion!$B$7:$AG$41,31,FALSE),\"\")","v":""},{"$f":"IF($O24>0,VLOOKUP($O24,Combustion!$B$7:$AG$41,32,FALSE),\"\")","v":""}]
[null,null,"Ash",null,6.55,null,null,null,null,null,null,"",null,"N25",null,null,{"$f":"IF($O25>0,VLOOKUP($O25,Combustion!$B$7:$AG$41,2,FALSE),\"\")","v":""},{"$f":"IF($O25>0,VLOOKUP($O25,Combustion!$B$7:$AG$41,3,FALSE),\"\")","v":""},{"$f":"IF($O25>0,VLOOKUP($O25,Combustion!$B$7:$AG$41,26,FALSE),\"\")","v":""},{"$f":"IF($O25>0,VLOOKUP($O25,Combustion!$B$7:$AG$41,27,FALSE),\"\")","v":""},{"$f":"IF($O25>0,VLOOKUP($O25,Combustion!$B$7:$AG$41,28,FALSE),\"\")","v":""},{"$f":"IF($O25>0,VLOOKUP($O25,Combustion!$B$7:$AG$41,29,FALSE),\"\")","v":""},{"$f":"IF($O25>0,VLOOKUP($O25,Combustion!$B$7:$AG$41,30,FALSE),\"\")","v":""},{"$f":"IF($O25>0,VLOOKUP($O25,Combustion!$B$7:$AG$41,31,FALSE),\"\")","v":""},{"$f":"IF($O25>0,VLOOKUP($O25,Combustion!$B$7:$AG$41,32,FALSE),\"\")","v":""}]
[null,null,"Total",null,{"$f":"SUM(E19:E25)","v":100},"Air:",{"$f":"IF($E$26=100,SUM(G19:G25),\"\")","v":1072.165157483438},"H2O:",{"$f":"IF($E$26=100,SUM(I19:I25),\"\")","v":42.956619872017455},null,null,null,null,"N26",null,null,{"$f":"IF($O26>0,VLOOKUP($O26,Combustion!$B$7:$AG$41,2,FALSE),\"\")","v":""},{"$f":"IF($O26>0,VLOOKUP($O26,Combustion!$B$7:$AG$41,3,FALSE),\"\")","v":""},{"$f":"IF($O26>0,VLOOKUP($O26,Combustion!$B$7:$AG$41,26,FALSE),\"\")","v":""},{"$f":"IF($O26>0,VLOOKUP($O26,Combustion!$B$7:$AG$41,27,FALSE),\"\")","v":""},{"$f":"IF($O26>0,VLOOKUP($O26,Combustion!$B$7:$AG$41,28,FALSE),\"\")","v":""},{"$f":"IF($O26>0,VLOOKUP($O26,Combustion!$B$7:$AG$41,29,FALSE),\"\")","v":""},{"$f":"IF($O26>0,VLOOKUP($O26,Combustion!$B$7:$AG$41,30,FALSE),\"\")","v":""},{"$f":"IF($O26>0,VLOOKUP($O26,Combustion!$B$7:$AG$41,31,FALSE),\"\")","v":""},{"$f":"IF($O26>0,VLOOKUP($O26,Combustion!$B$7:$AG$41,32,FALSE),\"\")","v":""}]
[null,null,null,null,{"$f":"IF(E26=100,\"\",\"↑ Please ensure the total add up is equal to 100%!\")","v":""},null,null,null,null,null,null,null,null,"N27",null,null,{"$f":"IF($O27>0,VLOOKUP($O27,Combustion!$B$7:$AG$41,2,FALSE),\"\")","v":""},{"$f":"IF($O27>0,VLOOKUP($O27,Combustion!$B$7:$AG$41,3,FALSE),\"\")","v":""},{"$f":"IF($O27>0,VLOOKUP($O27,Combustion!$B$7:$AG$41,26,FALSE),\"\")","v":""},{"$f":"IF($O27>0,VLOOKUP($O27,Combustion!$B$7:$AG$41,27,FALSE),\"\")","v":""},{"$f":"IF($O27>0,VLOOKUP($O27,Combustion!$B$7:$AG$41,28,FALSE),\"\")","v":""},{"$f":"IF($O27>0,VLOOKUP($O27,Combustion!$B$7:$AG$41,29,FALSE),\"\")","v":""},{"$f":"IF($O27>0,VLOOKUP($O27,Combustion!$B$7:$AG$41,30,FALSE),\"\")","v":""},{"$f":"IF($O27>0,VLOOKUP($O27,Combustion!$B$7:$AG$41,31,FALSE),\"\")","v":""},{"$f":"IF($O27>0,VLOOKUP($O27,Combustion!$B$7:$AG$41,32,FALSE),\"\")","v":""}]
[null,null,"Theoretical air:",null,{"$f":"MqThA*10000","v":7.6040082091023971},{"$f":"IF(Units_Pref=1,\"lb/ 10,000 Btu\",\"kg/ 10,000 kJ\")","v":"lb/ 10,000 Btu"},null,null,null,null,null,null,null,"N28",null,null,{"$f":"IF($O28>0,VLOOKUP($O28,Combustion!$B$7:$AG$41,2,FALSE),\"\")","v":""},{"$f":"IF($O28>0,VLOOKUP($O28,Combustion!$B$7:$AG$41,3,FALSE),\"\")","v":""},{"$f":"IF($O28>0,VLOOKUP($O28,Combustion!$B$7:$AG$41,26,FALSE),\"\")","v":""},{"$f":"IF($O28>0,VLOOKUP($O28,Combustion!$B$7:$AG$41,27,FALSE),\"\")","v":""},{"$f":"IF($O28>0,VLOOKUP($O28,Combustion!$B$7:$AG$41,28,FALSE),\"\")","v":""},{"$f":"IF($O28>0,VLOOKUP($O28,Combustion!$B$7:$AG$41,29,FALSE),\"\")","v":""},{"$f":"IF($O28>0,VLOOKUP($O28,Combustion!$B$7:$AG$41,30,FALSE),\"\")","v":""},{"$f":"IF($O28>0,VLOOKUP($O28,Combustion!$B$7:$AG$41,31,FALSE),\"\")","v":""},{"$f":"IF($O28>0,VLOOKUP($O28,Combustion!$B$7:$AG$41,32,FALSE),\"\")","v":""}]
[null,null,"Unburned Carbon:",null,{"$f":"MpUbC","v":0.38896551724137929},"% of Fuel"]
[null,null,"Theoretical air, Corrected:",null,{"$f":"MqThACr*10000","v":7.5722506021240541},{"$f":"IF(Units_Pref=1,\"lb/ 10,000 Btu\",\"kg/ 10,000 kJ\")","v":"lb/ 10,000 Btu"},null,{"$f":"MoThACr","v":0.36864474230452882},{"$f":"IF(Units_Pref=1,\"mol/ lb Fuel\",\"mol/ kg Fuel\")","v":"mol/ lb Fuel"}]
[null,null,"Calc. HHV (Dulong's equation)",null,{"$f":"(14544*(MpCb)/100+62028*(MpH2F-(MpO2F/8))/100+4050*MpSF/100)*Unit_Preference_Energy/Unit_Preference_Mass","v":14237.762105172416},{"$f":"IF(Units_Pref=1,\"Btu/lb\",\"kJ/kg\")","v":"Btu/lb"},{"$f":"(E31-F14)/F14","v":9.7703620689656972E-3},{"$f":"\"variance from measured HHV.\" & IF(ABS(G31)<0.05, \" GC less than 5% error. \nAcceptable.\",\" More than 5% error. Please check GC accuracy! You may proceed if you have double checked\")","v":"variance from measured HHV. GC less than 5% error. \nAcceptable."}]
[]
[null,"Input Conditions",null,null,null,null,null,null,null,null,null,null,null,"For Calculations "]
[null,null,"Temperature Data Measurement",null,null,null,null,null,null,null,null,null,null,"ASME Acronyms"]
[null,null,"Ambient temperature:",null,null,80,{"$f":"IF(Units_Pref=1,\"°F\",\"°C\")","v":"°F"},{"$f":"IF(ISBLANK(F35),\"¬\",\"\")","v":""},"Reference Temperature:",null,{"$f":"IF(Units_Pref=1,77,(77-32)*5/9)","v":77},{"$f":"IF(Units_Pref=1,\"°F\",\"°C\")","v":"°F"},null,"TMnA or TA",{"$f":"IF(Units_Pref=1,F35,F35*9/5+32)","v":80},"°F","(°F as basis for ambient temp)",null,null,null,null,null,null,null,null,null,{"$f":"IF(Units_Pref=AA$9,$F35,$F35*9/5+32)","v":80},{"$f":"IF(Units_Pref=AB$9,$F35,($F35-32)*5/9)","v":26.666666666666668}]
[null,null,"Entering air temperature (Dry-Bulb):",null,null,80,{"$f":"IF(Units_Pref=1,\"°F\",\"°C\")","v":"°F"},{"$f":"IF(ISBLANK(F36),\"¬\",\"\")","v":""},"as per ASME PTC 4",null,null,null,null,"TMnAEn",{"$f":"IF(Units_Pref=1,F36,F36*9/5+32)","v":80},"°F","(°F as basis for entering air temp)",null,null,null,null,null,null,null,null,null,{"$f":"IF(Units_Pref=AA$9,$F36,$F36*9/5+32)","v":80},{"$f":"IF(Units_Pref=AB$9,$F36,($F36-32)*5/9)","v":26.666666666666668}]
[null,null,"Flue gas temperature:",null,null,432,{"$f":"IF(Units_Pref=1,\"°F\",\"°C\")","v":"°F"},{"$f":"IF(ISBLANK(F37),\"¬\",\"\")","v":""},null,null,null,null,null,"TFgLvCr",{"$f":"IF(Units_Pref=1,F37,F37*9/5+32)","v":432},"°F","(°F as basis for flue gas temp)",null,null,null,null,{"$f":"(O37-32)*5/9+273.15","v":495.37222222222221},"K","(K as basis for HDFgLvCr)",null,null,{"$f":"IF(Units_Pref=AA$9,$F37,$F37*9/5+32)","v":432},{"$f":"IF(Units_Pref=AB$9,$F37,($F37-32)*5/9)","v":222.22222222222223}]
[null,null,"Fuel temperature:",null,null,80,{"$f":"IF(Units_Pref=1,\"°F\",\"°C\")","v":"°F"},{"$f":"IF(ISBLANK(F38),\"¬\",\"\")","v":""},null,null,null,null,null,"Tfuel",{"$f":"IF(Units_Pref=1,F38,F38*9/5+32)","v":80},"°F","(°F as basis for fuel temp)",null,null,null,null,null,null,null,null,null,{"$f":"IF(Units_Pref=AA$9,$F38,$F38*9/5+32)","v":80},{"$f":"IF(Units_Pref=AB$9,$F38,($F38-32)*5/9)","v":26.666666666666668}]
[null,null,null,null,null,null,null,null,null,null,null,null,null,"Tre",{"$f":"IF(Units_Pref=1,K35,K35*9/5+32)","v":77},"°F","(°F as basis for reference temp)",null,null,null,null,{"$f":"(O39-32)*5/9+273.15","v":298.14999999999998},"K","(K as basis for HDFgLvCr)",null,null,{"$f":"IF(Units_Pref=AA$9,$K35,$K35*9/5+32)","v":77},{"$f":"IF(Units_Pref=AB$9,$K35,($K35-32)*5/9)","v":25}]
[null,null,"Moisture Level Measurement & Calculation",null,null,null,null,null,null,null,null,null,null,"MFrThA",{"$f":"G26/100","v":10.721651574834379},"mass/mass fuel"]
[null,null,"Measurement Basis:",null,null,null,null,null,null,null,null,null,null,"MqThA",{"$f":"MFrThA/HHVF","v":7.6040082091023968E-4},"mass/ energy"]
[null,null,{"$f":"IF(P6=1,\"Wet-Bulb Temperature:\", \"Relative Humidity:\")","v":"Wet-Bulb Temperature:"},null,null,82,{"$f":"IF($P$6=1,IF(Units_Pref=1,\"°F\",\"°C\"),\"%\")","v":"°F"},{"$f":"IF(ISBLANK(F42),\"¬\",\"\")","v":""},null,null,null,{"$f":"IF(ISBLANK(F42),\"¬\",\"\")","v":""},null,"Twb",{"$f":"IF(Units_Pref=1,F42,F42*9/5+32)","v":82},"°F","(°F as basis for wet-bulb temp)",null,null,null,null,null,null,null,null,null,{"$f":"IF(Units_Pref=AA$9,$F42,$F42*9/5+32)","v":82},{"$f":"IF(Units_Pref=AB$9,$F42,($F42-32)*5/9)","v":27.777777777777779}]
[null,null,"Barometric Pressure:",null,null,{"$f":"Pa","v":14.69594878},{"$f":"IF(Units_Pref=1,\"psia\",\"bara\")","v":"psia"},null,null,null,null,null,null,"MqThACr",{"$f":"MqThA-MpUbC*F19/100/HHVF","v":7.5722506021240542E-4},"mass/ energy"]
[null,null,"Partial Pressure of H2O in Air:",null,null,{"$f":"PpWvA","v":0.55137680581295201},{"$f":"IF(Units_Pref=1,\"psia\",\"bara\")","v":"psia"},null,null,null,null,null,null,"PsWvTz",{"$f":"IF(Units_Pref=1,(Sat_C1+Sat_C2*O45+Sat_C3*O45^2+Sat_C4*O45^3+Sat_C5*O45^4+Sat_C6*O45^5)*Unit_Preference_Pressure,(Sat_C1+Sat_C2*O45+Sat_C3*O45^2+Sat_C4*O45^3+Sat_C5*O45^4+Sat_C6*O45^5)*Unit_Preference_Pressure/Unit_Preference_Press_SI)","v":0.54093769914250633},"psia","(psia as basis for saturation pressure)"]
[null,null,"Saturated Pressure of H2O:",null,null,{"$f":"PsWvTz","v":0.54093769914250633},{"$f":"IF(Units_Pref=1,\"psia\",\"bara\")","v":"psia"},{"$f":"IF($P$6=1,\"at wet-bulb temperature\",\"at dry-bulb temperature\")","v":"at wet-bulb temperature"},null,null,null,null,null,"Twb_Tdb",{"$f":"IF(Moist_Basis=1,O42,O36)","v":82},"°F","(°F as basis. Temp taken based on Moisture Measurement Basis)"]
[null,null,"Moisture level in air:",null,null,{"$f":"MFrWDA","v":2.4246500625224283E-2},{"$f":"IF(Units_Pref=1,\"lb/lb dry air\",\"kg/kg dry air\")","v":"lb/lb dry air"},null,null,null,null,null,null,"RHM",{"$f":"F42","v":82},"%"]
[null,null,"Additional moisture level in fuel:",null,null,null,{"$f":"IF(Units_Pref=1,\"lb/lb fuel\",\"kg/kg dry fuel\")","v":"lb/lb fuel"},null,null,null,null,{"$f":"IF(ISBLANK(F47),\"¬\",\"\")","v":"¬"},null,"MpCb",{"$f":"E19-MpUbC","v":79.921034482758628},"%"]
[null,null,null,null,null,null,null,null,null,null,null,null,null,"MpH2F",{"$f":"E20","v":4.47},"%"]
[null,null,"Flue Gas Measurement & Excess Air Calculation",null,null,null,null,null,null,null,null,null,null,"MpSF",1.54,"%"]
[null,null,"Flue Gas Measurement Basis:",null,null,null,null,null,null,null,null,null,null,"MpO2F",2.85,"%"]
[null,null,"Type of Flue Gas Measured:",null,null,null,null,null,null,null,null,null,null,"MpN2F",1.27,"%"]
[null,null,{"$f":"IF(Flue_Type=1, \"Excess O2 in Flue Gas:\", \"Excess CO2 in Flue Gas:\")","v":"Excess O2 in Flue Gas:"},null,{"$f":"IF(Flue_Measure_Basis=1,\"Dry:\",\"Wet:\")","v":"Dry:"},8.6,"% vol",{"$f":"IF(Flue_Measure_Basis=2,\"Dry:\",\"\")","v":""},{"$f":"IF(Flue_Type=1,IF(Flue_Measure_Basis=1,\"\",F54*MoThACr*Combustion!AD40/O63),IF(Flue_Measure_Basis=1,\"\",(MpCb)/Combustion!D7/Main!O63))","v":""},{"$f":"IF(Flue_Measure_Basis=1,\"\",\"% vol\")","v":""},null,{"$f":"IF(ISBLANK(F52),\"¬\",\"\")","v":""},null,"MpH2OF",3.01,"%",null,null,null,null,null,null,null,null,null,null,{"$f":"IF(Flue_Type=2,F54*H30*Combustion!AD40/Main!O63,F52)","v":8.6},{"$f":"IF(Flue_Type=1,(Main!E19-Main!E29)/Combustion!D7/(Main!O60+Main!H30*(Combustion!AE40+F54/100)),F52)","v":10.927765097692719}]
[null,null,"Carbon Monoxide in Flue:",null,{"$f":"IF(Flue_Measure_Basis=1,\"Dry:\",\"Wet:\")","v":"Dry:"},50,null,null,null,null,null,{"$f":"IF(ISBLANK(F53),\"¬\",\"\")","v":""},null,"MpAsF",6.55,"%"]
[null,null,"Excess Air:",null,null,{"$f":"XpA","v":67.817204950574791},"% vol",null,null,null,null,null,null,"MpUbC",{"$f":"F15*HHVF/(14500*Unit_Preference_Energy/Unit_Preference_Mass)","v":0.38896551724137929},"%"]
[null,null,"Actual Dry Air:",null,null,{"$f":"MqDA*10000","v":12.707539312337659},{"$f":"F28","v":"lb/ 10,000 Btu"},null,"Total Wet Flue Gas:",null,{"$f":"MqFg*10000","v":13.980316887501415},{"$f":"G59","v":"lb/ 10,000 Btu"},null,"HHVF",{"$f":"F14","v":14100},"energy/mass"]
[null,null,"H2O from Dry Air:",null,null,{"$f":"MqWA*10000","v":0.30811335988165717},{"$f":"G55","v":"lb/ 10,000 Btu"},null,"H2O in Wet Flue Gas:",null,{"$f":"MqWFg*10000","v":0.89607959920105373},{"$f":"L55","v":"lb/ 10,000 Btu"},null,"MoThACr",{"$f":"MqThACr/Combustion!D40*HHVF","v":0.36864474230452882},"moles/mass fuel"]
[null,null,"Additional H2O from Dry Air:",null,null,{"$f":"MqWAd*10000","v":0},{"$f":"G56","v":"lb/ 10,000 Btu"},null,"H2O Percent in Wet Gas:",null,{"$f":"MpWFg","v":6.4095800289202352},"% by mass",null,"MqFgF",{"$f":"(100-MpAsF-MpUbC)/100/HHVF","v":6.6000733675715347E-5},"mass/ energy"]
[null,null,"H2O from Fuel:",null,null,{"$f":"MqWF*10000","v":0.3046568785249465},{"$f":"G57","v":"lb/ 10,000 Btu"},null,"Dry Flue Gas:",null,{"$f":"MqDFg*10000","v":13.084237288300359},{"$f":"L56","v":"lb/ 10,000 Btu"},null,"MqWF",{"$f":"I26/100/HHVF","v":3.0465687852494649E-5},"mass/ energy"]
[null,null,"Wet Gas from Fuel:",null,null,{"$f":"MqFgF*10000","v":0.66000733675715351},{"$f":"G58","v":"lb/ 10,000 Btu"},null,null,null,null,null,null,"MqWH2F",{"$f":"1/D20*Combustion!$D$39*MpH2F/100/HHVF","v":2.8330936079445004E-5},"mass/energy"]
[null,null,null,null,null,null,null,null,null,null,null,null,null,"MoDPc",{"$f":"(E19-MpUbC)/100/Combustion!D7+Main!E21/100/Combustion!D36+Main!E23/100/Combustion!D10","v":6.7473481121638049E-2},"moles/mass fuel"]
[null,null,"Ash Data Section",null,null,null,null,null,null,null,null,null,null,"MoWPc",{"$f":"O60+E20/100/Combustion!D8+Main!E24/100/Combustion!D39+Main!F47/Combustion!D39","v":9.1318002096596809E-2},"moles/mass fuel"]
[null,null,"Any Ash Residue?",null,null,null,null,null,null,null,null,null,null,"MoWA",{"$f":"F46*Combustion!D40/Combustion!D39","v":3.8980159883990728E-2},"moles H2O/moles dry air"]
[null,null,null,null,null,"Ash Spilt %",null,null,null,null,null,null,null,"MoDFg",{"$f":"O60+MoThACr*(Combustion!AE40+Main!F54/100)","v":0.60890645613124095},"moles of dry gas/mass fuel"]
[null,null,"Bottom Ash:",null,null,10,{"$f":"IF(AND(F$67<>100,Ash_Res=1),\"¬\",\"\")","v":""},{"$f":"IF(OR(ISBLANK(F64),ISBLANK(I64)=FALSE),\"\",IF(F64=0,\"\",\"Entry Req. >>\"))","v":""},2000,{"$f":"IF(Units_Pref=1,\"°F\",\"°C\")","v":"°F"},{"$f":"\"default = \"&IF(Units_Pref=1,\" 2000 °F\",\" 1100 °C\")","v":"default =  2000 °F"},null,null,"MoFg",{"$f":"MoWPc+MoThACr*(Combustion!AE40+Main!O62+XpA/100*(1+MoWA))","v":0.65686602583884002},"moles of wet gas/mass fuel",null,null,null,null,null,null,null,null,null,null,{"$f":"IF(Units_Pref=AA$9,$I64,$I64*9/5+32)","v":2000},{"$f":"IF(Units_Pref=AB$9,$I64,($I64-32)*5/9)","v":1093.3333333333333}]
[null,null,"Economizer Ash:",null,null,10,{"$f":"IF(AND(F$67<>100,Ash_Res=1),\"¬\",\"\")","v":""},{"$f":"IF(OR(ISBLANK(F65),ISBLANK(I65)=FALSE),\"\",IF(F65=0,\"\",\"Entry Req. >>\"))","v":""},390.2,{"$f":"IF(Units_Pref=1,\"°F\",\"°C\")","v":"°F"},{"$f":"\"default = \"&IF(Units_Pref=1, TFgLvCr & \" °F\",ROUND((TFgLvCr-32)*5/9,0) & \" °C\")","v":"default = 432 °F"},null,null,"MqDFg",{"$f":"MqFg-MqWFg","v":1.308423728830036E-3},"mass/ energy",null,null,null,null,null,null,null,null,null,null,{"$f":"IF(Units_Pref=AA$9,$I65,$I65*9/5+32)","v":390.2},{"$f":"IF(Units_Pref=AB$9,$I65,($I65-32)*5/9)","v":199}]
[null,null,"Fly/Precipitator/Baghouse Ash:",null,null,80,{"$f":"IF(AND(F$67<>100,Ash_Res=1),\"¬\",\"\")","v":""},{"$f":"IF(OR(ISBLANK(F66),ISBLANK(I66)=FALSE),\"\",IF(F66=0,\"\",\"Entry Req. >>\"))","v":""},390.2,{"$f":"IF(Units_Pref=1,\"°F\",\"°C\")","v":"°F"},{"$f":"\"default = \"&IF(Units_Pref=1, TFgLvCr & \" °F\",ROUND((TFgLvCr-32)*5/9,0) & \" °C\")","v":"default = 432 °F"},null,null,"PpWvA",{"$f":"IF(Moist_Basis=1,(PsWvTz-((14.69594878-PsWvTz)*(O36-Twb)/(2830-1.44*Twb)))*Unit_Preference_Pressure,0.01*RHM*PsWvTz)","v":0.55137680581295201},"pressure",null,null,null,null,null,null,null,null,null,null,{"$f":"IF(Units_Pref=AA$9,$I66,$I66*9/5+32)","v":390.2},{"$f":"IF(Units_Pref=AB$9,$I66,($I66-32)*5/9)","v":199}]
[null,null,"Total Ash",null,null,{"$f":"SUM(F64:F66)","v":100},"%",null,null,null,null,null,null,"MFrWDA",{"$f":"0.622*PpWvA/(Pa-PpWvA)","v":2.4246500625224283E-2},"mass H2O/mass dry air"]
[null,null,null,null,null,{"$f":"IF(OR(F67=100,Ash_Res=2),\"\",\"↑ Please ensure the total add up is equal to 100%!\")","v":""},null,null,null,null,null,null,null,"Pa",{"$f":"14.69594878*Unit_Preference_Pressure","v":14.69594878},"pressure"]
[null,null,"Unburned Carbon Residual:",null,null,{"$f":"F15*100/(14500*Unit_Preference_Energy/Unit_Preference_Mass)","v":2.7586206896551722E-3},{"$f":"G59","v":"lb/ 10,000 Btu"},null,null,null,null,null,null,"MFrWAdz",{"$f":"F47","v":0},"mass/mass fuel"]
[null,null,"Ash Residue in Fuel:",null,null,{"$f":"MqRs*10000","v":4.6453900709219856E-2},{"$f":"G69","v":"lb/ 10,000 Btu"},null,null,null,null,null,null,"XpA",{"$f":"IF(Flue_Type=1,IF(Flue_Measure_Basis=1,100*F52*(O60+Combustion!AE40*MoThACr)/MoThACr/(Combustion!AD40*100-F52),(100*F52*(O61+(Combustion!AE40+O62)*MoThACr))/MoThACr/(Combustion!AD40*100-F52*(1+O62))),IF(Flue_Measure_Basis=1,(((MpCb)/Combustion!D7*(1/Main!F52)-O60)/MoThACr-Combustion!AE40)*100,(((MpCb)/Combustion!D7*(1/Main!F52)-O61)/MoThACr-Combustion!AE40-O62)/(1+O62)*100))","v":67.817204950574791},"%"]
[null,null,"Total Residue:",null,null,{"$f":"MqRs_all*10000","v":0},{"$f":"G70","v":"lb/ 10,000 Btu"},null,null,null,null,null,null,"MqDA",{"$f":"MqThACr*(1+XpA/100)","v":1.2707539312337658E-3},"mass/ energy"]
[null,null,null,null,null,null,null,null,null,null,null,null,null,"MqWA",{"$f":"MFrWDA*MqDA","v":3.0811335988165716E-5},"mass/ energy"]
[null,null,"Steam Generator / Boiler Section",null,null,null,null,null,null,null,null,null,null,"MqWAd",{"$f":"MFrWAdz/HHVF","v":0},"mass/ energy"]
[null,null,"Average Surface Temperature:",null,null,140,{"$f":"IF(Units_Pref=1,\"°F\",\"°C\")","v":"°F"},null,null,null,null,{"$f":"IF(ISBLANK(F74),\"¬\",\"\")","v":""},null,"MqFg",{"$f":"MqDA+MqWA+MqFgF+MqWAd+MqWF","v":1.3980316887501414E-3},"mass/ energy",null,null,null,null,null,null,null,null,null,null,{"$f":"IF(Units_Pref=AA$9,$F74,$F74*9/5+32)","v":140},{"$f":"IF(Units_Pref=AB$9,$F74,($F74-32)*5/9)","v":60}]
[null,null,"Dimensions",null,null,null,null,null,null,null,null,null,null,"TMnAf",{"$f":"IF(Units_Pref=1,F74,F74*9/5+32)","v":140},"°F","(°F as basis for boiler surf. temp)"]
[null,null,"Height:",null,null,10,{"$f":"IF(Units_Pref=1,\"ft\",\"m\")","v":"ft"},null,null,null,null,{"$f":"IF(ISBLANK(F76),\"¬\",\"\")","v":""},null,"MqWFg",{"$f":"MqWF+MqWH2F+MqWA+MqWAd","v":8.9607959920105369E-5},"mass/ energy",null,null,null,null,null,null,null,null,null,null,{"$f":"IF(Units_Pref=AA$9,$F76,$F76/Unit_Preference_Length_SI)","v":10},{"$f":"IF(Units_Pref=AB$9,$F76,$F76*Unit_Preference_Length_SI)","v":3.048}]
[null,null,"Length:",null,null,14,{"$f":"IF(Units_Pref=1,\"ft\",\"m\")","v":"ft"},null,null,null,null,{"$f":"IF(ISBLANK(F77),\"¬\",\"\")","v":""},null,"MpWFg",{"$f":"100*MqWFg/MqFg","v":6.4095800289202352},"% mass",null,null,null,null,null,null,null,null,null,null,{"$f":"IF(Units_Pref=AA$9,$F77,$F77/Unit_Preference_Length_SI)","v":14},{"$f":"IF(Units_Pref=AB$9,$F77,$F77*Unit_Preference_Length_SI)","v":4.2671999999999999}]
[null,null,"Width:",null,null,12,{"$f":"IF(Units_Pref=1,\"ft\",\"m\")","v":"ft"},null,null,null,null,{"$f":"IF(ISBLANK(F78),\"¬\",\"\")","v":""},null,"MFrRs",{"$f":"MpAsF/(100)","v":6.5500000000000003E-2},"mass/mass fuel",null,null,null,null,null,null,null,null,null,null,{"$f":"IF(Units_Pref=AA$9,$F78,$F78/Unit_Preference_Length_SI)","v":12},{"$f":"IF(Units_Pref=AB$9,$F78,$F78*Unit_Preference_Length_SI)","v":3.6576000000000004}]
[null,null,"Total Surface Area (excl. bottom area):",null,null,{"$f":"2*F76*(F77+F78)+F77*F78","v":688},{"$f":"IF(Units_Pref=1,\"ft²\",\"m²\")","v":"ft²"},"flat projected surface area",null,null,null,null,null,"MqRs",{"$f":"MpAsF/HHVF/100","v":4.6453900709219854E-6},"mass/ energy"]
[null,null,"Wind Velocity:",null,null,5,{"$f":"IF(Units_Pref=1,\"ft/s\",\"m/s\")","v":"ft/s"},{"$f":"\"default = \" & (ROUND(1.67*Unit_Preference_Velocity,2) & IF(Units_Pref=1, \" ft/s\", \" m/s\"))","v":"default = 1.67 ft/s"},null,null,null,{"$f":"IF(ISBLANK(F80),\"¬\",\"\")","v":""},null,"DVpCO",{"$f":"IF(Flue_Measure_Basis=1,IF(CO_Unit=1,F53*10^(-6)*100,F53),\"-\")","v":4.9999999999999992E-3},"% vol",null,null,null,null,null,null,null,null,null,null,{"$f":"IF(Units_Pref=AA$9,$F80,$F80/Unit_Preference_Length_SI)","v":5},{"$f":"IF(Units_Pref=AB$9,$F80,$F80*Unit_Preference_Length_SI)","v":1.524}]
[null,null,null,null,null,null,null,null,null,null,null,null,null,"VpCO",{"$f":"IF(Flue_Measure_Basis=2,IF(CO_Unit=1,F53*10^(-6)*100,F53),\"-\")","v":"-"},"% vol"]
[null,"Losses",null,null,null,null,null,null,null,null,null,null,null,"QpLDFg",{"$f":"100*MqDFg*HDFgLvCr","v":11.20608229702613},"%"]
[null,null,"Dry Gas Loss:",null,null,{"$f":"QpLDFg","v":11.20608229702613},"%",null,null,null,null,null,null,"HDFgLvCr",{"$f":"IF(V37<1000,(FG_C0+FG_C1*V37+FG_C2*V37^2+FG_C3*V37^3+FG_C4*V37^4+FG_C5*V37^5)-(FG_C0+FG_C1*V39+FG_C2*V39^2+FG_C3*V39^3+FG_C4*V39^4+FG_C5*V39^5),(FG_C0_1000+FG_C1_1000*V37+FG_C2_1000*V37^2+FG_C3_1000*V37^3+FG_C4_1000*V37^4+FG_C5_1000*V37^5)-(FG_C0_1000+FG_C1_1000*V39+FG_C2_1000*V39^2+FG_C3_1000*V39^3+FG_C4_1000*V39^4+FG_C5_1000*V39^5))*Unit_Preference_Energy/Unit_Preference_Mass","v":85.645666996931993},"energy/mass"]
[null,null,"Water from H2 Combustion Loss:",null,null,{"$f":"QpLH2F","v":3.4325744529746851},"%",null,null,null,null,null,null,"HStLvCr",{"$f":"(H20_C0*TFgLvCr+H20_C1*TFgLvCr^2+H20_C2)*Unit_Preference_Energy/Unit_Preference_Mass","v":1256.5993779200001},"energy/mass"]
[null,null,"Moisture in Fuel Loss:",null,null,{"$f":"QpLWF","v":0.49216145221647584},"%",null,null,null,null,null,null,"QpLWF",{"$f":"100*MqWF*IF(Fuel_Type=8,HWvLvCr,(HStLvCr-HWRe))","v":0.49216145221647584},"%"]
[null,null,"Moisture in Air Loss:",null,null,{"$f":"QpLWA","v":0.49774526470846464},"%",null,null,null,null,null,null,"HWvLvCr",{"$f":"(subH20_C0*TFgLvCr+subH20_C1*TFgLvCr^2+subH20_C2*TFgLvCr^3+subH20_C3)*Unit_Preference_Energy/Unit_Preference_Mass","v":161.546148112384},"energy/mass"]
[null,null,"Unburned Carbon in Residue Loss:",null,null,{"$f":"QpLUbC","v":0.4},"%",null,null,null,null,null,null,"QpLWA",{"$f":"100*MFrWDA*(MqDA)*HWvLvCr","v":0.49774526470846464},"%"]
[null,null,"Carbon Monoxide in Flue Gas Loss:",null,null,{"$f":"QpLCO","v":2.6291200760519169E-2},"%",null,null,null,null,null,null,"HWRe",{"$f":"(O39-32)*Unit_Preference_Energy/Unit_Preference_Mass","v":45},"energy/mass"]
[null,null,"Sensible Heat of Residue Loss:",null,null,{"$f":"QpLRs","v":0},"%",null,null,null,null,null,null,"QpLH2F",{"$f":"100*MqWH2F*(HStLvCr-HWRe)","v":3.4325744529746851},"%"]
[null,null,"Surface Radiation & Convection Loss:",null,null,{"$f":"QrLSrc","v":6.0370052612299614E-2},"%",null,null,null,null,null,null,"QpLUbC",{"$f":"MpUbC*(14500*Unit_Preference_Energy/Unit_Preference_Mass)/HHVF","v":0.4},"%"]
[null,null,"Other Unaccounted Losses:",null,null,0.5,"%","default = 0.5%",null,null,null,{"$f":"IF(ISBLANK(F91),\"¬\",\"\")","v":""},null,"QpLCO",{"$f":"IF(Flue_Measure_Basis=1,DVpCO*MoDFg*Combustion!D12*(4347*Unit_Preference_Energy/Unit_Preference_Mass)/HHVF,VpCO*MoFg*Combustion!D12*(4347*Unit_Preference_Energy/Unit_Preference_Mass)/HHVF)","v":2.6291200760519169E-2},"%"]
[null,null,"Manufacturers' Margins:",null,null,1,"%","default = 1%",null,null,null,{"$f":"IF(ISBLANK(F92),\"¬\",\"\")","v":""},null,"MqRs_all",{"$f":"IF(Ash_Res=1,SUM(F69:F70)/10000,0)","v":0},"mass/ energy"]
[null,null,"Summation of Losses",null,null,{"$f":"SUM(F83:F90)+OUL+ManM","v":17.615224720298574},"%",null,null,null,null,null,null,"HRs_Btm",{"$f":"DR_C0*T_ashbtm+DR_C1*T_ashbtm^2-DR_C2*T_ashbtm^3-DR_C3","v":515.6099999999999},"energy/mass"]
[null,null,null,null,null,null,null,null,null,null,null,null,null,"HRs_Econ",{"$f":"DR_C0*T_asheco+DR_C1*T_asheco^2-DR_C2*T_asheco^3-DR_C3","v":64.388873337448558},"energy/mass"]
[null,"Credits",null,null,null,null,null,null,null,null,null,null,null,"HRs_Fly",{"$f":"DR_C0*T_ashfly+DR_C1*T_ashfly^2-DR_C2*T_ashfly^3-DR_C3","v":64.388873337448558},"energy/mass"]
[null,null,"Entering Dry Air:",null,null,{"$f":"QpBDA","v":9.1565424450568492E-2},"%",null,null,null,null,null,null,"HRs_Re",{"$f":"DR_C0*Tre+DR_C1*Tre^2-DR_C2*Tre^3-DR_C3","v":3.2817668100015851E-3},"energy/mass"]
[null,null,"Moisture in Entering Air:",null,null,{"$f":"QpBWA","v":4.1106916207556427E-3},"%",null,null,null,null,null,null,"T_ashbtm",{"$f":"IF(Units_Pref=1,IF(ISBLANK(I64),2000,I64),IF(ISBLANK(I64),2000,I64*9/5+32))","v":2000},"°F","(°F as basis for bottom ash temp)"]
[null,null,"Sensible Heat in Fuel:",null,null,{"$f":"100/(HHVF/Unit_Preference_Energy*Unit_Preference_Mass)*IF(Fuel_Type=1,(Hcoal-Hcoal_ref),IF(Fuel_Type=8,(HGF-HGF_ref),IF(Fuel_Type=9,0,(Hfo-Hfo_ref))))","v":1.0587466896595741E-2},"%",null,null,null,null,null,null,"T_asheco",{"$f":"IF(Units_Pref=1,IF(ISBLANK(I65),TFgLvCr,I65),IF(ISBLANK(I65),TFgLvCr,I65*9/5+32))","v":390.2},"°F","(°F as basis for economizer ash temp)"]
[null,null,"Summation of Credits",null,null,{"$f":"SUM(F96:F98)","v":0.10626358296791988},"%",null,null,null,null,null,null,"T_ashfly",{"$f":"IF(Units_Pref=1,IF(ISBLANK(I66),TFgLvCr,I66),IF(ISBLANK(I66),TFgLvCr,I66*9/5+32))","v":390.2},"°F","(°F as basis for fly ash temp)"]
[null,null,null,null,null,null,null,null,null,null,null,null,null,"QpLRs",{"$f":"100*MqRs_all/100*(F64*(HRs_Btm-HRs_Re)+F65*(HRs_Econ-HRs_Re)+F66*(HRs_Fly-HRs_Re))*(Unit_Preference_Energy/Unit_Preference_Mass)","v":0},"%"]
[null,"Boiler Performance Parameter",null,null,null,null,null,null,null,null,null,null,null,"VA",{"$f":"IF(ISBLANK(F80),1.67,IF(Units_Pref=1,F80,F80/Unit_Preference_Length_SI))","v":5},"ft/s","(ft/s as basis for surface radiation & convection)"]
[null,null,"Efficiency",null,null,{"$f":"100-F93+F99","v":82.491038862669356},"%",null,null,null,null,null,null,"Hca",{"$f":"MAX(0.2*(TMnAf-TMnA)^0.33,0.35*VA^0.8)","v":1.2683644114359671},"Btu/ft²hF"]
[null,null,"Useful Output",null,null,{"$f":"F13*F14/10^6*F102/100","v":127.94360127600017},{"$f":"IF(Units_Pref=1,\"MMBtu\",\"MJ\")","v":"MMBtu"},null,null,null,null,null,null,"Tdi",{"$f":"IF((TMnAf-TMnA)<50,50,TMnAf-TMnA)","v":60},"°F","(differential temp should be > 50°F)"]
[null,null,"Air to Burners (wet)",null,null,{"$f":"(1+MFrWDA)*(1+XpA/100)*MqThACr*10000","v":13.015652672219316},{"$f":"IF(Units_Pref=1,\"lb/ 10,000 Btu\",\"kg/ 10,000 kJ\")","v":"lb/ 10,000 Btu"},null,null,null,null,null,null,"Hra",{"$f":"0.847+0.002367*Tdi+0.00000294*Tdi^2+0.00000000137*Tdi^3","v":0.99989992000000005},"Btu/ft²hF"]
[null,null,null,null,null,{"$f":"F104/10000*F13*F14/1000","v":201.87277294612161},{"$f":"IF(Units_Pref=1,\",000 lb/h\",\",000 kg/h\")","v":",000 lb/h"},null,null,null,null,null,null,"Af",{"$f":"IF(Units_Pref=1,F79,F79/Unit_Preference_Length^2)","v":688},"ft²","(ft² as basis for surface radiation & convection)"]
[null,null,"Note:",null,null,null,null,null,null,null,null,null,null,"QrLSrc",{"$f":"(Hca+Hra)*Af*(Tdi)/(HHVF/Unit_Preference_Energy*Unit_Preference_Mass)/(MrF/Unit_Preference_Mass)*100","v":6.0370052612299614E-2},"%"]
[null,null,"The efficiency test does not account for:",null,null,null,null,null,null,null,null,null,null,"MrF",{"$f":"F13","v":11000},"mass/time"]
[null,null,"1) Standby Losses. Efficiency test is to be carried out when the boiler is operating under steady load.",null,null,null,null,null,null,null,null,null,null,"OUL",{"$f":"IF(ISBLANK(F91),0.5,F91)","v":0.5},"%"]
[null,null,"2) Blowdown Loss.",null,null,null,null,null,null,null,null,null,null,"ManM",{"$f":"IF(ISBLANK(F92),1,F92)","v":1},"%"]
[null,null,"3) Soot Blower Steam.",null,null,null,null,null,null,null,null,null,null,"HDAEn",{"$f":"(DG_C0+DG_C1*TK_TMnAEn+DG_C2*TK_TMnAEn^2+DG_C3*TK_TMnAEn^3+DG_C4*TK_TMnAEn^4+DG_C5*TK_TMnAEn^5)-(DG_C0+DG_C1*TK_Tre+DG_C2*TK_Tre^2+DG_C3*TK_Tre^3+DG_C4*TK_Tre^4+DG_C5*TK_Tre^5)","v":0.72055983617275365},"energy/mass",null,null,null,null,null,null,null,null,"(btu/lb as basis)"]
[null,null,"4) Auxiliary Equipment Energy Consumption. Efficiency test does not account for energy usage by burners, fans and pumps",null,null,null,null,null,null,null,null,null,null,"TK_TMnAEn",{"$f":"(TMnAEn+459.7)/1.8","v":299.83333333333337},"K"]
[null,null,null,null,null,null,null,null,null,null,null,null,null,"QpBDA",{"$f":"100*(MqDA/Unit_Preference_Mass*Unit_Preference_Energy)*HDAEn","v":9.1565424450568492E-2},"%"]
[null,null,null,null,null,null,null,{"$f":"C83","v":"Dry Gas Loss:"},{"$f":"ROUND(F83,2) & \" %\"","v":"11.21 %"},null,null,null,null,"HWvEn",{"$f":"(subH20_C0*TMnAEn+subH20_C1*TMnAEn^2+subH20_C2*TMnAEn^3+subH20_C3)-(subH20_C0*Tre+subH20_C1*Tre^2+subH20_C2*Tre^3+subH20_C3)","v":1.334149100946},"energy/mass",null,null,null,null,null,null,null,null,"(btu/lb as basis)"]
[null,null,null,null,null,null,null,{"$f":"C84","v":"Water from H2 Combustion Loss:"},{"$f":"ROUND(F84,2) & \" %\"","v":"3.43 %"},null,null,null,null,"TK_Tre",{"$f":"(Tre+459.7)/1.8","v":298.16666666666669},"K"]
[null,null,null,null,null,null,null,{"$f":"C85","v":"Moisture in Fuel Loss:"},{"$f":"ROUND(F85,2) & \" %\"","v":"0.49 %"},null,null,null,null,"QpBWA",{"$f":"100*MFrWDA*(MqDA/Unit_Preference_Mass*Unit_Preference_Energy)*HWvEn","v":4.1106916207556427E-3},"%"]
[null,null,null,null,null,null,null,{"$f":"C86","v":"Moisture in Air Loss:"},{"$f":"ROUND(F86,2) & \" %\"","v":"0.5 %"},null,null,null,null,"Hfo",{"$f":"-30.016-0.11426*API+0.373*Tfuel+(0.00143)*API*Tfuel+((0.0002184)+(0.0000007)*API)*(Tfuel)^2","v":940.64769007604605},"energy/mass",null,"Hfo_ref",null,{"$f":"-30.016-0.11426*API+0.373*Tre+(0.00143)*API*Tre+((0.0002184)+(0.0000007)*API)*(Tre)^2","v":6.0895283770946662E-2},"energy/mass",null,null,null,"(btu/lb as basis)"]
[null,null,null,null,null,null,null,{"$f":"C88","v":"Carbon Monoxide in Flue Gas Loss:"},{"$f":"ROUND(F88,2) & \" %\"","v":"0.03 %"},null,null,null,null,"API",{"$f":"(141.5-131.5*Sg)/Sg","v":203338.94590390602}]
[null,null,null,null,null,null,null,null,null,null,null,null,null,"Dn",{"$f":"VLOOKUP(CHOOSE(Fuel_Type,Fuel!B4,Fuel!B5,Fuel!B6,Fuel!B7,Fuel!B8,Fuel!B9,Fuel!B10,Fuel!B11,Fuel!B12),Fuel_List,2,FALSE)","v":4.3394999999999996E-2},"mass/volume"]
[null,null,null,null,null,null,null,null,null,null,null,null,null,"Sg",{"$f":"Dn/62.4","v":6.9543269230769224E-4},"mass/mass"]
[null,null,null,null,null,{"$f":"C90","v":"Surface Radiation & Convection Loss:"},null,{"$f":"ROUND(F90,2) & \" %\"","v":"0.06 %"},null,null,null,null,null,"HGF",{"$f":"0.4693*Tfuel+(0.00017523)*Tfuel^2+(0.00000004326)*Tfuel^3-37.2","v":1.4876211199999929},"energy/mass",null,"HGF_ref",null,{"$f":"0.4693*Tre+(0.00017523)*Tre^2+(0.00000004326)*Tre^3-37.2","v":-5.2117124200066201E-3},"energy/mass",null,null,null,"(btu/lb as basis)"]
[null,null,null,null,null,null,null,null,null,"Overall Efficiency:",null,null,null,"Hcoal",{"$f":"((MpCb+MpUbC)*HFc+MpH2OF*HW+MpAsF*HRs)/100","v":0.56629280000000015},"energy/mass",null,"Hcoal_ref",null,{"$f":"((MpCb+MpUbC)*HFc_ref+MpH2OF*HW_ref+MpAsF*HRs_ref)/100","v":1.4544049999970453E-4},"energy/mass",null,null,null,"(btu/lb as basis)"]
[null,null,null,null,null,null,null,null,null,{"$f":"F102","v":82.491038862669356},"%",null,null,"HFc",{"$f":"0.152*Tfuel+(0.000195)*Tfuel^2-12.86","v":0.54800000000000004},"energy/mass",null,"HFc_ref",null,{"$f":"0.152*Tre+(0.000195)*Tre^2-12.86","v":1.5499999999946112E-4},"energy/mass",null,null,null,"(btu/lb as basis)"]
[null,null,null,null,"Fuel Input",null,null,null,null,null,null,null,null,"HRs",{"$f":"0.17*Tfuel+(0.00008)*Tfuel^2-13.564","v":0.54800000000000182},"energy/mass",null,"HRs_ref",null,{"$f":"0.17*Tre+(0.00008)*Tre^2-13.564","v":3.2000000000209639E-4},"energy/mass",null,null,null,"(btu/lb as basis)"]
[null,null,null,null,{"$f":"ROUND(F13,0)","v":11000},{"$f":"G13","v":"lb/h"},null,null,null,"Steam Output",null,null,null,"HW",{"$f":"Tfuel-77","v":3},"energy/mass",null,"HW_ref",null,{"$f":"Tre-77","v":0},"energy/mass",null,null,null,"(btu/lb as basis)"]
[null,null,null,null,null,null,null,null,null,{"$f":"ROUND(F103,0) & \" \" & G103","v":"128 MMBtu"}]
[]
[]
[]
[null,null,null,null,"Air Input"]
[null,null,null,null,{"$f":"ROUND(F105,0)","v":202},{"$f":"G105","v":",000 lb/h"}]
[null,null,null,null,null,null,null,null,null,{"$f":"C87","v":"Unburned Carbon in Residue Loss:"},{"$f":"ROUND(F87,2) & \" %\"","v":"0.4 %"}]
[null,null,null,null,null,null,null,null,null,{"$f":"C89","v":"Sensible Heat of Residue Loss:"},{"$f":"ROUND(F89,2) & \" %\"","v":"0 %"}]
[null,null,null,null,null,null,null,null,null,{"$f":"C91","v":"Other Unaccounted Losses:"},{"$f":"ROUND(F91,2) & \" %\"","v":"0.5 %"}]
[null,null,null,null,null,{"$f":"C96","v":"Entering Dry Air:"},{"$f":"ROUND(F96,2) & \" %\"","v":"0.09 %"},null,null,{"$f":"C92","v":"Manufacturers' Margins:"},{"$f":"ROUND(F92,2) & \" %\"","v":"1 %"}]
[null,null,null,null,null,{"$f":"C97","v":"Moisture in Entering Air:"},{"$f":"ROUND(F97,2) & \" %\"","v":"0 %"}]
[null,null,null,null,null,"Sensible Heat in Fuel:","0.01 %"]
[]
[null,null,"Copy Rights: Not to be copied or distributed without specific permission from Inveno Engineering LLC; kelly.paffel@invenoeng.com"]

{"sheet":"Blank for Calculation","index":1,"n_rows":3,"n_cols":1,"rows_kept":3,"cut":false,"hidden":false,"merged":[]}
["User Calculations Sheet"]
[]
["This is a blank sheet provided for the user to make notes, carry out calculations etc."]

{"sheet":"Excess Air","index":2,"n_rows":104,"n_cols":3,"rows_kept":104,"cut":false,"hidden":false,"merged":[[103,1,103,2]]}
[null,"Percent of Excess Air based on Oxygen Content in Flue Gas"]
[null,"Oxygen Content in Flue Gas","Excess Air \nPercent"]
[null,0,{"$f":"100*B3*(MoDPc+Combustion!$AE$40*MoThACr)/MoThACr/(Combustion!$AD$40*100-B3*100)","v":0}]
[null,1E-3,{"$f":"100*B4*(MoDPc+Combustion!$AE$40*MoThACr)/MoThACr/(Combustion!$AD$40*100-B4*100)","v":4.6703021064762665E-3}]
[null,2E-3,{"$f":"100*B5*(MoDPc+Combustion!$AE$40*MoThACr)/MoThACr/(Combustion!$AD$40*100-B5*100)","v":9.3856278522707268E-3}]
[null,3.0000000000000001E-3,{"$f":"100*B6*(MoDPc+Combustion!$AE$40*MoThACr)/MoThACr/(Combustion!$AD$40*100-B6*100)","v":1.4146631460564404E-2}]
[null,4.0000000000000001E-3,{"$f":"100*B7*(MoDPc+Combustion!$AE$40*MoThACr)/MoThACr/(Combustion!$AD$40*100-B7*100)","v":1.8953979891288667E-2}]
[null,5.0000000000000001E-3,{"$f":"100*B8*(MoDPc+Combustion!$AE$40*MoThACr)/MoThACr/(Combustion!$AD$40*100-B8*100)","v":2.3808353152598122E-2}]
[null,6.0000000000000001E-3,{"$f":"100*B9*(MoDPc+Combustion!$AE$40*MoThACr)/MoThACr/(Combustion!$AD$40*100-B9*100)","v":2.871044462152882E-2}]
[null,7.0000000000000001E-3,{"$f":"100*B10*(MoDPc+Combustion!$AE$40*MoThACr)/MoThACr/(Combustion!$AD$40*100-B10*100)","v":3.3660961374159325E-2}]
[null,8.0000000000000002E-3,{"$f":"100*B11*(MoDPc+Combustion!$AE$40*MoThACr)/MoThACr/(Combustion!$AD$40*100-B11*100)","v":3.8660624525604786E-2}]
[null,8.9999999999999993E-3,{"$f":"100*B12*(MoDPc+Combustion!$AE$40*MoThACr)/MoThACr/(Combustion!$AD$40*100-B12*100)","v":4.3710169580187475E-2}]
[null,0.01,{"$f":"100*B13*(MoDPc+Combustion!$AE$40*MoThACr)/MoThACr/(Combustion!$AD$40*100-B13*100)","v":4.8810346792140899E-2}]
[null,1.0999999999999999E-2,{"$f":"100*B14*(MoDPc+Combustion!$AE$40*MoThACr)/MoThACr/(Combustion!$AD$40*100-B14*100)","v":5.3961921537218918E-2}]
[null,1.2E-2,{"$f":"100*B15*(MoDPc+Combustion!$AE$40*MoThACr)/MoThACr/(Combustion!$AD$40*100-B15*100)","v":5.916567469559661E-2}]
[null,1.2999999999999999E-2,{"$f":"100*B16*(MoDPc+Combustion!$AE$40*MoThACr)/MoThACr/(Combustion!$AD$40*100-B16*100)","v":6.4422403046465196E-2}]
[null,1.4E-2,{"$f":"100*B17*(MoDPc+Combustion!$AE$40*MoThACr)/MoThACr/(Combustion!$AD$40*100-B17*100)","v":6.973291967473956E-2}]
[null,1.4999999999999999E-2,{"$f":"100*B18*(MoDPc+Combustion!$AE$40*MoThACr)/MoThACr/(Combustion!$AD$40*100-B18*100)","v":7.5098054390314903E-2}]
[null,1.6E-2,{"$f":"100*B19*(MoDPc+Combustion!$AE$40*MoThACr)/MoThACr/(Combustion!$AD$40*100-B19*100)","v":8.0518654160326067E-2}]
[null,1.7000000000000001E-2,{"$f":"100*B20*(MoDPc+Combustion!$AE$40*MoThACr)/MoThACr/(Combustion!$AD$40*100-B20*100)","v":8.5995583554882696E-2}]
[null,1.7999999999999999E-2,{"$f":"100*B21*(MoDPc+Combustion!$AE$40*MoThACr)/MoThACr/(Combustion!$AD$40*100-B21*100)","v":9.1529725206773022E-2}]
[null,1.9E-2,{"$f":"100*B22*(MoDPc+Combustion!$AE$40*MoThACr)/MoThACr/(Combustion!$AD$40*100-B22*100)","v":9.7121980285649501E-2}]
[null,0.02,{"$f":"100*B23*(MoDPc+Combustion!$AE$40*MoThACr)/MoThACr/(Combustion!$AD$40*100-B23*100)","v":0.10277326898723133}]
[null,2.1000000000000001E-2,{"$f":"100*B24*(MoDPc+Combustion!$AE$40*MoThACr)/MoThACr/(Combustion!$AD$40*100-B24*100)","v":0.1084845310380818}]
[null,2.1999999999999999E-2,{"$f":"100*B25*(MoDPc+Combustion!$AE$40*MoThACr)/MoThACr/(Combustion!$AD$40*100-B25*100)","v":0.11425672621654182}]
[null,2.3E-2,{"$f":"100*B26*(MoDPc+Combustion!$AE$40*MoThACr)/MoThACr/(Combustion!$AD$40*100-B26*100)","v":0.12009083489042675}]
[null,2.4E-2,{"$f":"100*B27*(MoDPc+Combustion!$AE$40*MoThACr)/MoThACr/(Combustion!$AD$40*100-B27*100)","v":0.12598785857211803}]
[null,2.5000000000000001E-2,{"$f":"100*B28*(MoDPc+Combustion!$AE$40*MoThACr)/MoThACr/(Combustion!$AD$40*100-B28*100)","v":0.13194882049171125}]
[null,2.5999999999999999E-2,{"$f":"100*B29*(MoDPc+Combustion!$AE$40*MoThACr)/MoThACr/(Combustion!$AD$40*100-B29*100)","v":0.13797476618890822}]
[null,2.7E-2,{"$f":"100*B30*(MoDPc+Combustion!$AE$40*MoThACr)/MoThACr/(Combustion!$AD$40*100-B30*100)","v":0.14406676412437328}]
[null,2.8000000000000001E-2,{"$f":"100*B31*(MoDPc+Combustion!$AE$40*MoThACr)/MoThACr/(Combustion!$AD$40*100-B31*100)","v":0.15022590631130381}]
[null,2.9000000000000001E-2,{"$f":"100*B32*(MoDPc+Combustion!$AE$40*MoThACr)/MoThACr/(Combustion!$AD$40*100-B32*100)","v":0.15645330896799975}]
[null,0.03,{"$f":"100*B33*(MoDPc+Combustion!$AE$40*MoThACr)/MoThACr/(Combustion!$AD$40*100-B33*100)","v":0.1627501131922505}]
[null,3.1E-2,{"$f":"100*B34*(MoDPc+Combustion!$AE$40*MoThACr)/MoThACr/(Combustion!$AD$40*100-B34*100)","v":0.16911748565839579}]
[null,3.2000000000000001E-2,{"$f":"100*B35*(MoDPc+Combustion!$AE$40*MoThACr)/MoThACr/(Combustion!$AD$40*100-B35*100)","v":0.17555661933795422}]
[null,3.3000000000000002E-2,{"$f":"100*B36*(MoDPc+Combustion!$AE$40*MoThACr)/MoThACr/(Combustion!$AD$40*100-B36*100)","v":0.18206873424475462}]
[null,3.4000000000000002E-2,{"$f":"100*B37*(MoDPc+Combustion!$AE$40*MoThACr)/MoThACr/(Combustion!$AD$40*100-B37*100)","v":0.188655078205548}]
[null,3.5000000000000003E-2,{"$f":"100*B38*(MoDPc+Combustion!$AE$40*MoThACr)/MoThACr/(Combustion!$AD$40*100-B38*100)","v":0.19531692765712189}]
[null,3.5999999999999997E-2,{"$f":"100*B39*(MoDPc+Combustion!$AE$40*MoThACr)/MoThACr/(Combustion!$AD$40*100-B39*100)","v":0.20205558847098767}]
[null,3.6999999999999998E-2,{"$f":"100*B40*(MoDPc+Combustion!$AE$40*MoThACr)/MoThACr/(Combustion!$AD$40*100-B40*100)","v":0.20887239680675845}]
[null,3.7999999999999999E-2,{"$f":"100*B41*(MoDPc+Combustion!$AE$40*MoThACr)/MoThACr/(Combustion!$AD$40*100-B41*100)","v":0.21576871999539024}]
[null,3.9E-2,{"$f":"100*B42*(MoDPc+Combustion!$AE$40*MoThACr)/MoThACr/(Combustion!$AD$40*100-B42*100)","v":0.22274595745351194}]
[null,0.04,{"$f":"100*B43*(MoDPc+Combustion!$AE$40*MoThACr)/MoThACr/(Combustion!$AD$40*100-B43*100)","v":0.2298055416301292}]
[null,4.1000000000000002E-2,{"$f":"100*B44*(MoDPc+Combustion!$AE$40*MoThACr)/MoThACr/(Combustion!$AD$40*100-B44*100)","v":0.23694893898704589}]
[null,4.2000000000000003E-2,{"$f":"100*B45*(MoDPc+Combustion!$AE$40*MoThACr)/MoThACr/(Combustion!$AD$40*100-B45*100)","v":0.2441776510144141}]
[null,4.2999999999999997E-2,{"$f":"100*B46*(MoDPc+Combustion!$AE$40*MoThACr)/MoThACr/(Combustion!$AD$40*100-B46*100)","v":0.25149321528288976}]
[null,4.3999999999999997E-2,{"$f":"100*B47*(MoDPc+Combustion!$AE$40*MoThACr)/MoThACr/(Combustion!$AD$40*100-B47*100)","v":0.25889720653394088}]
[null,4.4999999999999998E-2,{"$f":"100*B48*(MoDPc+Combustion!$AE$40*MoThACr)/MoThACr/(Combustion!$AD$40*100-B48*100)","v":0.26639123780993496}]
[null,4.5999999999999999E-2,{"$f":"100*B49*(MoDPc+Combustion!$AE$40*MoThACr)/MoThACr/(Combustion!$AD$40*100-B49*100)","v":0.27397696162570623}]
[null,4.7E-2,{"$f":"100*B50*(MoDPc+Combustion!$AE$40*MoThACr)/MoThACr/(Combustion!$AD$40*100-B50*100)","v":0.28165607118339275}]
[null,4.8000000000000001E-2,{"$f":"100*B51*(MoDPc+Combustion!$AE$40*MoThACr)/MoThACr/(Combustion!$AD$40*100-B51*100)","v":0.2894303016324169}]
[null,4.9000000000000002E-2,{"$f":"100*B52*(MoDPc+Combustion!$AE$40*MoThACr)/MoThACr/(Combustion!$AD$40*100-B52*100)","v":0.29730143137658038}]
[null,0.05,{"$f":"100*B53*(MoDPc+Combustion!$AE$40*MoThACr)/MoThACr/(Combustion!$AD$40*100-B53*100)","v":0.30527128343034066}]
[null,5.0999999999999997E-2,{"$f":"100*B54*(MoDPc+Combustion!$AE$40*MoThACr)/MoThACr/(Combustion!$AD$40*100-B54*100)","v":0.31334172682644296}]
[null,5.1999999999999998E-2,{"$f":"100*B55*(MoDPc+Combustion!$AE$40*MoThACr)/MoThACr/(Combustion!$AD$40*100-B55*100)","v":0.32151467807718914}]
[null,5.2999999999999999E-2,{"$f":"100*B56*(MoDPc+Combustion!$AE$40*MoThACr)/MoThACr/(Combustion!$AD$40*100-B56*100)","v":0.32979210269174386}]
[null,5.3999999999999999E-2,{"$f":"100*B57*(MoDPc+Combustion!$AE$40*MoThACr)/MoThACr/(Combustion!$AD$40*100-B57*100)","v":0.33817601675200243}]
[null,5.5E-2,{"$f":"100*B58*(MoDPc+Combustion!$AE$40*MoThACr)/MoThACr/(Combustion!$AD$40*100-B58*100)","v":0.34666848854967197}]
[null,5.6000000000000001E-2,{"$f":"100*B59*(MoDPc+Combustion!$AE$40*MoThACr)/MoThACr/(Combustion!$AD$40*100-B59*100)","v":0.35527164028736075}]
[null,5.7000000000000002E-2,{"$f":"100*B60*(MoDPc+Combustion!$AE$40*MoThACr)/MoThACr/(Combustion!$AD$40*100-B60*100)","v":0.36398764984661164}]
[null,5.8000000000000003E-2,{"$f":"100*B61*(MoDPc+Combustion!$AE$40*MoThACr)/MoThACr/(Combustion!$AD$40*100-B61*100)","v":0.37281875262597691}]
[null,5.8999999999999997E-2,{"$f":"100*B62*(MoDPc+Combustion!$AE$40*MoThACr)/MoThACr/(Combustion!$AD$40*100-B62*100)","v":0.38176724345238922}]
[null,0.06,{"$f":"100*B63*(MoDPc+Combustion!$AE$40*MoThACr)/MoThACr/(Combustion!$AD$40*100-B63*100)","v":0.39083547856926631}]
[null,6.0999999999999999E-2,{"$f":"100*B64*(MoDPc+Combustion!$AE$40*MoThACr)/MoThACr/(Combustion!$AD$40*100-B64*100)","v":0.40002587770496145}]
[null,6.2E-2,{"$f":"100*B65*(MoDPc+Combustion!$AE$40*MoThACr)/MoThACr/(Combustion!$AD$40*100-B65*100)","v":0.4093409262253806}]
[null,6.3E-2,{"$f":"100*B66*(MoDPc+Combustion!$AE$40*MoThACr)/MoThACr/(Combustion!$AD$40*100-B66*100)","v":0.41878317737478266}]
[null,6.4000000000000001E-2,{"$f":"100*B67*(MoDPc+Combustion!$AE$40*MoThACr)/MoThACr/(Combustion!$AD$40*100-B67*100)","v":0.42835525460901086}]
[null,6.5000000000000002E-2,{"$f":"100*B68*(MoDPc+Combustion!$AE$40*MoThACr)/MoThACr/(Combustion!$AD$40*100-B68*100)","v":0.43805985402563169}]
[null,6.6000000000000003E-2,{"$f":"100*B69*(MoDPc+Combustion!$AE$40*MoThACr)/MoThACr/(Combustion!$AD$40*100-B69*100)","v":0.44789974689571171}]
[null,6.7000000000000004E-2,{"$f":"100*B70*(MoDPc+Combustion!$AE$40*MoThACr)/MoThACr/(Combustion!$AD$40*100-B70*100)","v":0.45787778230222409}]
[null,6.8000000000000005E-2,{"$f":"100*B71*(MoDPc+Combustion!$AE$40*MoThACr)/MoThACr/(Combustion!$AD$40*100-B71*100)","v":0.46799688989036403}]
[null,6.9000000000000006E-2,{"$f":"100*B72*(MoDPc+Combustion!$AE$40*MoThACr)/MoThACr/(Combustion!$AD$40*100-B72*100)","v":0.47826008273534765}]
[null,7.0000000000000007E-2,{"$f":"100*B73*(MoDPc+Combustion!$AE$40*MoThACr)/MoThACr/(Combustion!$AD$40*100-B73*100)","v":0.48867046033359363}]
[null,7.0999999999999994E-2,{"$f":"100*B74*(MoDPc+Combustion!$AE$40*MoThACr)/MoThACr/(Combustion!$AD$40*100-B74*100)","v":0.49923121172352303}]
[null,7.1999999999999995E-2,{"$f":"100*B75*(MoDPc+Combustion!$AE$40*MoThACr)/MoThACr/(Combustion!$AD$40*100-B75*100)","v":0.50994561874257993}]
[null,7.2999999999999995E-2,{"$f":"100*B76*(MoDPc+Combustion!$AE$40*MoThACr)/MoThACr/(Combustion!$AD$40*100-B76*100)","v":0.52081705942745926}]
[null,7.3999999999999996E-2,{"$f":"100*B77*(MoDPc+Combustion!$AE$40*MoThACr)/MoThACr/(Combustion!$AD$40*100-B77*100)","v":0.53184901156494258}]
[null,7.4999999999999997E-2,{"$f":"100*B78*(MoDPc+Combustion!$AE$40*MoThACr)/MoThACr/(Combustion!$AD$40*100-B78*100)","v":0.54304505640118372}]
[null,7.6000000000000095E-2,{"$f":"100*B79*(MoDPc+Combustion!$AE$40*MoThACr)/MoThACr/(Combustion!$AD$40*100-B79*100)","v":0.55440888251775322}]
[null,7.7000000000000096E-2,{"$f":"100*B80*(MoDPc+Combustion!$AE$40*MoThACr)/MoThACr/(Combustion!$AD$40*100-B80*100)","v":0.56594428988325085}]
[null,7.8000000000000097E-2,{"$f":"100*B81*(MoDPc+Combustion!$AE$40*MoThACr)/MoThACr/(Combustion!$AD$40*100-B81*100)","v":0.57765519408984822}]
[null,7.9000000000000098E-2,{"$f":"100*B82*(MoDPc+Combustion!$AE$40*MoThACr)/MoThACr/(Combustion!$AD$40*100-B82*100)","v":0.58954563078466582}]
[null,8.0000000000000099E-2,{"$f":"100*B83*(MoDPc+Combustion!$AE$40*MoThACr)/MoThACr/(Combustion!$AD$40*100-B83*100)","v":0.60161976030653141}]
[null,8.10000000000001E-2,{"$f":"100*B84*(MoDPc+Combustion!$AE$40*MoThACr)/MoThACr/(Combustion!$AD$40*100-B84*100)","v":0.6138818725393087}]
[null,8.2000000000000101E-2,{"$f":"100*B85*(MoDPc+Combustion!$AE$40*MoThACr)/MoThACr/(Combustion!$AD$40*100-B85*100)","v":0.62633639199368929}]
[null,8.3000000000000101E-2,{"$f":"100*B86*(MoDPc+Combustion!$AE$40*MoThACr)/MoThACr/(Combustion!$AD$40*100-B86*100)","v":0.63898788313009391}]
[null,8.4000000000000102E-2,{"$f":"100*B87*(MoDPc+Combustion!$AE$40*MoThACr)/MoThACr/(Combustion!$AD$40*100-B87*100)","v":0.65184105593613684}]
[null,8.5000000000000103E-2,{"$f":"100*B88*(MoDPc+Combustion!$AE$40*MoThACr)/MoThACr/(Combustion!$AD$40*100-B88*100)","v":0.66490077177296947}]
[null,8.6000000000000104E-2,{"$f":"100*B89*(MoDPc+Combustion!$AE$40*MoThACr)/MoThACr/(Combustion!$AD$40*100-B89*100)","v":0.67817204950574927}]
[null,8.7000000000000105E-2,{"$f":"100*B90*(MoDPc+Combustion!$AE$40*MoThACr)/MoThACr/(Combustion!$AD$40*100-B90*100)","v":0.69166007193447532}]
[null,8.8000000000000106E-2,{"$f":"100*B91*(MoDPc+Combustion!$AE$40*MoThACr)/MoThACr/(Combustion!$AD$40*100-B91*100)","v":0.705370192542499}]
[null,8.9000000000000107E-2,{"$f":"100*B92*(MoDPc+Combustion!$AE$40*MoThACr)/MoThACr/(Combustion!$AD$40*100-B92*100)","v":0.71930794258117181}]
[null,9.0000000000000094E-2,{"$f":"100*B93*(MoDPc+Combustion!$AE$40*MoThACr)/MoThACr/(Combustion!$AD$40*100-B93*100)","v":0.73347903851032947}]
[null,9.1000000000000095E-2,{"$f":"100*B94*(MoDPc+Combustion!$AE$40*MoThACr)/MoThACr/(Combustion!$AD$40*100-B94*100)","v":0.74788938981563413}]
[null,9.2000000000000096E-2,{"$f":"100*B95*(MoDPc+Combustion!$AE$40*MoThACr)/MoThACr/(Combustion!$AD$40*100-B95*100)","v":0.76254510722523472}]
[null,9.3000000000000096E-2,{"$f":"100*B96*(MoDPc+Combustion!$AE$40*MoThACr)/MoThACr/(Combustion!$AD$40*100-B96*100)","v":0.7774525113497518}]
[null,9.4000000000000097E-2,{"$f":"100*B97*(MoDPc+Combustion!$AE$40*MoThACr)/MoThACr/(Combustion!$AD$40*100-B97*100)","v":0.79261814177124668}]
[null,9.5000000000000098E-2,{"$f":"100*B98*(MoDPc+Combustion!$AE$40*MoThACr)/MoThACr/(Combustion!$AD$40*100-B98*100)","v":0.80804876660863367}]
[null,9.6000000000000099E-2,{"$f":"100*B99*(MoDPc+Combustion!$AE$40*MoThACr)/MoThACr/(Combustion!$AD$40*100-B99*100)","v":0.82375139258893226}]
[null,9.70000000000001E-2,{"$f":"100*B100*(MoDPc+Combustion!$AE$40*MoThACr)/MoThACr/(Combustion!$AD$40*100-B100*100)","v":0.83973327565584466}]
[null,9.8000000000000101E-2,{"$f":"100*B101*(MoDPc+Combustion!$AE$40*MoThACr)/MoThACr/(Combustion!$AD$40*100-B101*100)","v":0.8560019321494019}]
[null,9.9000000000000102E-2,{"$f":"100*B102*(MoDPc+Combustion!$AE$40*MoThACr)/MoThACr/(Combustion!$AD$40*100-B102*100)","v":0.87256515059286976}]
[null,0.1,{"$f":"100*B103*(MoDPc+Combustion!$AE$40*MoThACr)/MoThACr/(Combustion!$AD$40*100-B103*100)","v":0.88943100412574672}]
[null,"Copy Rights: Not to be copied or distributed without specific permission from Inveno Engineering LLC; kelly.paffel@invenoeng.com"]

{"sheet":"Fuel","index":3,"n_rows":12,"n_cols":4,"rows_kept":12,"cut":false,"hidden":false,"merged":[[1,2,1,3],[1,1,2,1],[11,1,11,3]]}
[]
[null,"Fuel","Density"]
[null,null,"lb/ft3","kg/m3"]
[null,"Coal"]
[null,"Diesel",3.5270000000000001,{"$f":"C5*16.01846337","v":56.497120305990002}]
[null,"Fuel No.2",57.4,919.4597974379999]
[null,"Fuel No.6",59.9,959.50595586299994]
[null,"Gasoline",44.9,719.2290053129999]
[null,"Heavy Fuel oil",58,929.07087545999991]
[null,"Kerosene",49.9,799.32132216299999]
[null,"Natural Gas",4.3394999999999996E-2,0.69512121794114989]
[null,"Copy Rights: Not to be copied or distributed without specific permission from Inveno Engineering LLC; kelly.paffel@invenoeng.com"]

{"sheet":"Combustion","index":4,"n_rows":66,"n_cols":33,"rows_kept":66,"cut":false,"hidden":false,"merged":[[3,32,4,32],[2,26,2,32],[54,8,54,10],[3,31,4,31],[3,26,4,26],[3,27,4,27],[3,28,4,28],[3,29,4,29],[3,30,4,30],[44,1,44,9],[3,14,3,17],[3,21,3,24],[3,6,4,6],[54,6,54,7],[54,2,54,4],[2,7,2,10],[3,9,3,10],[3,18,3,20],[3,3,4,3],[3,2,4,2],[2,11,2,17],[2,18,2,24],[3,11,3,13],[3,7,3,8],[65,1,65,9],[3,0,4,0],[3,4,4,4],[3,5,4,5],[3,25,4,25],[3,1,4,1],[55,2,55,4],[56,2,56,4],[57,2,57,4],[63,2,63,4],[64,2,64,4],[58,2,58,4],[59,2,59,4],[60,2,60,4],[61,2,61,4],[62,2,62,4]]}
[null,1,2,3,4,5,6,7,8,9,10,11,12,13,14,15,16,17,18,19,20,21,22,23,24,25,26,27,28,29,30,31]
["(Source) Table 1 : Combustion Constants - Combustion Engineering Chapter 10"]
[null,null,null,null,null,null,null,"Heat of Combustion c",null,null,null,"ft³ per ft³ of Combustible",null,null,null,null,null,null,"lb per lb of Combustible",null,null,null,null,null,null,null,"Elemental Breakdown"]
["No.","Substance","Formula  ","Molecular Weight a","Density b (lb/ft³)","Specific Volume b (ft³/lb)","Specific Gravity b (air=1)","Btu per ft³",null,"Btu per lb",null,"Required for Combustion",null,null,"Flue Products",null,null,null,"Required for Combustion",null,null,"Flue Products",null,null,null,"Theor air lb/ 10000 Btu","C","H2","S","O2","N2","H2O","Ash"]
[null,null,null,null,null,null,null,"Gross d ","Net e  ","Gross d ","Net e  ","O2","N2 a","Air","CO2","H2O ","N2 a","SO2","O2","N2 a","Air","CO2","H2O ","N2 a","SO2"]
[]
[1,"Carbon","C",12.010999999999999,null,null,null,null,null,14093,14093,1,3.7730000000000001,4.7729999999999997,1,null,3.7730000000000001,null,2.6640000000000001,8.8460000000000001,11.51,3.6640000000000001,null,8.8460000000000001,null,8.1669999999999998,1]
[2,"Hydrogen","H2",2.0158999999999998,5.3E-3,188.245,6.9599999999999995E-2,324.2,273.89999999999998,61029,51558,0.5,1.887,2.387,null,1,1.887,null,7.9359999999999999,26.353000000000002,34.29,null,8.9369999999999994,26.353000000000002,null,5.6189999999999998,null,1]
[3,"Oxygen","O2",31.998799999999999,8.4400000000000003E-2,11.85,1.1052999999999999,null,null,null,null,null,null,null,null,null,null,null,null,null,null,null,null,null,null,null,null,null,null,1]
[4,"Nitrogen","N2",28.013400000000001,7.3800000000000004E-2,13.542999999999999,0.96709999999999996,null,null,null,null,null,null,null,null,null,null,null,null,null,null,null,null,null,null,null,null,null,null,null,1]
[4,"Nitrogen (atm.)","N2a",28.158000000000001,7.4200000000000002E-2,13.474,0.97199999999999998,null,null,null,null,null,null,null,null,null,null,null,null,null,null,null,null,null,null,null,null,null,null,null,1]
[5,"Carbon Monoxide","CO",28.010400000000001,7.3800000000000004E-2,13.542,0.96719999999999995,320.60000000000002,320.60000000000002,4342,4342,0.5,1.887,2.387,1,null,1.887,null,0.57099999999999995,1.897,2.468,1.571,null,1.897,null,5.6840000000000002,1,null,null,0.5]
[6,"Carbon Dioxide","CO2",44.009799999999998,0.1166,8.5739999999999998,1.5277000000000001,null,null,null,null,null,null,null,null,null,null,null,null,null,null,null,null,null,null,null,1,null,null,1]
[7,"Methane","CH4",16.0428,4.24E-2,23.608000000000001,0.55479999999999996,1012,911,23891,21511,2,7.5469999999999997,9.5470000000000006,1,2,7.5469999999999997,null,3.9889999999999999,13.246,17.234999999999999,2.7429999999999999,2.246,13.246,null,7.2140000000000004,1,2]
[8,"Ethane","C2H6",30.069700000000001,7.9899999999999999E-2,12.513999999999999,1.0466,1785,1634,22334,20429,3.5,13.206,16.706,2,3,13.206,null,3.7240000000000002,12.367000000000001,16.091999999999999,2.927,1.7969999999999999,12.367000000000001,null,7.2050000000000001,2,3]
[9,"Propane","C3H8",44.096600000000002,0.1183,8.4559999999999995,1.5488999999999999,2561,2359,21653,19921,5,18.866,23.866,3,4,18.866,null,3.6280000000000001,12.047000000000001,15.676,2.9940000000000002,1.6339999999999999,12.047000000000001,null,7.2389999999999999,3,4]
[10,"n-Butane","C4H10",58.1235,0.1585,6.31,2.0758000000000001,3376,3124,21299,19657,6.5,24.526,31.026,4,5,24.526,null,3.5779999999999998,11.882,15.46,3.0289999999999999,1.55,11.882,null,7.2590000000000003,4,5]
[11,"Isobutane","C4H10,iso",58.1235,0.158,6.3280000000000003,2.0699000000000001,3355,3104,21231,19589,6.5,24.526,31.026,4,5,24.526,null,3.5779999999999998,11.882,15.46,3.0289999999999999,1.55,11.882,null,7.282,4,5]
[12,"n-Pentane","C5H12",72.150400000000005,0.2019,4.952,2.645,4258,3956,21085,19498,8,30.186,38.186,5,6,30.186,null,3.548,11.781000000000001,15.329000000000001,3.05,1.498,11.781000000000001,null,7.27,5,6]
[13,"Isopentane","C5H12,iso",72.150400000000005,0.2001,4.9989999999999997,2.6202000000000001,4210,3908,21043,19455,8,30.186,38.186,5,6,30.186,null,3.548,11.781000000000001,15.329000000000001,3.05,1.498,11.781000000000001,null,7.2839999999999998,5,6]
[14,"Neopentane","C5H12,neo",72.150400000000005,0.19839999999999999,5.04,2.5989,4159,3857,20958,19370,8,30.186,38.186,5,6,30.186,null,3.548,11.781000000000001,15.329000000000001,3.05,1.498,11.781000000000001,null,7.3140000000000001,5,6]
[15,"n-Hexane","C6H14",86.177300000000002,0.25080000000000002,3.9870000000000001,3.2848999999999999,5252,4900,20943,19392,9.5,35.845999999999997,45.345999999999997,6,7,35.845999999999997,null,3.5270000000000001,11.712999999999999,15.24,3.0640000000000001,1.4630000000000001,11.712999999999999,null,7.2770000000000001,6,7]
[16,"Ethylene","C2H4",28.053799999999999,7.4399999999999994E-2,13.446999999999999,0.97399999999999998,1609,1509,21643,20282,3,11.32,14.32,2,2,11.32,null,3.4220000000000002,11.362,14.784000000000001,3.1379999999999999,1.284,11.362,null,6.8310000000000004,2,2]
[17,"Propylene","C3H6",42.0807,0.11269999999999999,8.8740000000000006,1.476,2371,2220,21039,19678,4.5,16.98,21.48,3,3,16.98,null,3.4220000000000002,11.362,14.784000000000001,3.1379999999999999,1.284,11.362,null,7.0270000000000001,3,3]
[18,"n-Butene (Butylene)","C4H8",56.107599999999998,0.15240000000000001,6.56,1.9965999999999999,3175,2974,20831,19470,6,22.64,28.64,4,4,22.64,null,3.4220000000000002,11.362,14.784000000000001,3.1379999999999999,1.284,11.362,null,7.0970000000000004,4,4]
[19,"Isobutene","C4H8,iso",56.107599999999998,0.15240000000000001,6.5609999999999999,1.9964,3156,2955,20704,19343,6,22.64,28.64,4,4,22.64,null,3.4220000000000002,11.362,14.784000000000001,3.1379999999999999,1.284,11.362,null,7.141,4,4]
[20,"n-Pentene","C5H10",70.134500000000003,0.19470000000000001,5.1349999999999998,2.5508000000000002,4032,3781,20704,19343,7.5,28.3,35.799999999999997,5,5,28.3,null,3.4220000000000002,11.362,14.784000000000001,3.1379999999999999,1.284,11.362,null,7.14,5,5]
[21,"Benzene","C6H6",78.113699999999994,0.2213,4.5179999999999998,2.8988999999999998,4024,3873,18179,17446,7.5,28.3,35.799999999999997,6,3,28.3,null,3.0720000000000001,10.201000000000001,13.273999999999999,3.38,0.69199999999999995,10.201000000000001,null,7.3019999999999996,6,3]
[22,"Toluene","C7H8",92.140600000000006,0.27500000000000002,3.637,3.6015999999999999,5068,4867,18430,17602,9,33.959000000000003,42.959000000000003,7,4,33.959000000000003,null,3.125,10.378,13.504,3.343,0.78200000000000003,10.378,null,7.327,7,4]
[23,"Xylene","C8H10",106.1675,0.34799999999999998,2.8740000000000001,4.5575999999999999,6480,6228,18622,17723,10.5,39.619,50.119,8,5,39.619,null,3.1640000000000001,10.507999999999999,13.673,3.3159999999999998,0.84799999999999998,10.507999999999999,null,7.3419999999999996,4,5]
[24,"Acetylene","C2H2",26.0379,6.9099999999999995E-2,14.48,0.90459999999999996,1484,1433,21482,20749,2.5,9.4329999999999998,11.933,2,1,9.4329999999999998,null,3.0720000000000001,10.201000000000001,13.273999999999999,3.38,0.69199999999999995,10.201000000000001,null,6.1790000000000003,2,1]
[25,"Naphthalene","C10H8",128.17359999999999,0.33839999999999998,2.9550000000000001,4.4322999999999997,5866,5665,17335,16739,12,45.279000000000003,57.279000000000003,10,4,45.279000000000003,null,2.9950000000000001,9.9469999999999992,12.943,3.4340000000000002,0.56200000000000006,9.9469999999999992,null,7.4669999999999996,10,4]
[26,"Methyl alcohol","CH3OH",32.042200000000001,8.4599999999999995E-2,11.82,1.1081000000000001,868,768,10265,9073,1.5,5.66,7.16,1,2,5.66,null,1.498,4.9740000000000002,6.4720000000000004,1.373,1.1240000000000001,4.9740000000000002,null,6.3049999999999997,1,2,null,0.5]
[27,"Ethyl alcohol","C2H5OH",46.069099999999999,0.1216,8.2240000000000002,1.5927,1602,1451,13172,11929,3,11.32,14.32,2,3,11.32,null,2.0840000000000001,6.9189999999999996,9.0030000000000001,1.911,1.173,6.9189999999999996,null,6.835,2,3,null,0.5]
[28,"Ammonia","NH3",17.0306,4.5400000000000003E-2,22.007999999999999,0.59509999999999996,440,364,9680,7998,0.75,2.83,3.58,null,1.5,3.33,null,1.409,4.6790000000000003,6.0880000000000001,null,1.587,5.5019999999999998,null,6.29,null,1.5,null,null,0.5]
[29,"Sulfur","S",32.066000000000003,null,null,null,null,null,3980,3980,1,3.7730000000000001,4.7729999999999997,null,null,3.7730000000000001,1,1,3.32,4.3099999999999996,1.998,null,3.32,1.998,10.829000000000001,null,null,1]
[30,"Hydrogen sulfide","H2S",34.081899999999997,9.0700000000000003E-2,11.03,1.1875,643,593,7094,6534,1.5,5.66,7.16,null,1,5.66,1,1.41,4.6820000000000004,6.093,1.88,0.52900000000000003,4.6820000000000004,1.88,8.5760000000000005,null,1,1]
[31,"Sulfur dioxide","SO2",64.064800000000005,0.17219999999999999,5.806,2.2557999999999998,null,null,null,null,null,null,null,null,null,null,null,null,null,null,null,null,null,null,null,null,null,1,1]
[32,"Water","H2O",18.0153,5.0299999999999997E-2,19.863,0.65939999999999999,50.311999999999998,0,1059.8,0,null,null,null,null,null,null,null,null,null,null,null,null,null,null,null,null,null,null,null,null,1]
[33,"Air",null,28.962499999999999,7.6300000000000007E-2,13.098000000000001,1,null,null,null,null,null,null,null,null,null,null,null,null,null,null,null,null,null,null,null,null,null,null,0.20946000000000001,{"$f":"1-AD40","v":0.79054000000000002}]
[34,"Ash","Ash",36,null,null,null,null,null,null,null,null,null,null,null,null,null,null,null,null,null,null,null,null,null,null,null,null,null,null,null,null,1]
[]
["All gas volumes corrected to 60F and 14.696 psi dry."]
["a","1987 Atomic Weights: C=12.011, H=1.00794, O=15.9994, N=14.0067, S=32.066."]
["b","Densities calculated from ideal values and compressibility factor given in ASTM D 3588-98. Some of the materials can not exist as gases at 60F and 14.696 psi, in which case which these materials are present, their partial pressure is low enough to keep them as gases.the values are theoretical ones. Under the actual concentrations in"]
["c","For gases saturated with water at 60F and 14.696 psi, 1.74% of the Btu value must be deducted. Reference 2."]
["d","Reference 2, ASTM 3588-98."]
["e","Correction from gross to net heating value determined by deducting the HV shown for water vapor times the moles of H2."]
["f","Reference 3, Jones, F.E."]
["g","Gas Processors Suppliers Association (GPSA) Data Book, Fig 23-2, Physical Constants, 1987."]
["h","Either the density or the compressibility factor has been assumed."]
[]
[]
["(Source) Table 2 : Common Chemical Reactions of Combustion - Combustion Engineering Chapter 10"]
["No.","Combustible","Reaction",null,null,"Mole","Mass or weight, lb",null,"Heat of Combustion (High) Btu/lb of Fuel"]
[1,"Carbon (to CO)","2C + O2 = 2CO",null,null,"2 + 1 = 2","24 + 32 =",56,null,3967]
[2,"Carbon (to CO2)","C + O2 = CO2",null,null,"1 + 1 = 1","12 + 32 =",44,null,14093]
[3,"Carbon Monoxide","2CO + O2 = 2CO2",null,null,"2 + 1 = 2","56 + 32 =",88,null,4342]
[4,"Hydrogen","2H2 + O2 = 2H2O",null,null,"2 + 1 = 2","4 +32 =",36,null,61029]
[5,"Sulfur (to SO2)","S + O2 = SO2",null,null,"1 + 1 = 1","32 + 32 =",64,null,3980]
[6,"Methane","CH4 + 2O2 = CO2 + 2H2O",null,null,"1 + 2 = 1 + 2","16 + 64 =",80,null,23891]
[7,"Acetylene","2C2H2 + 5O2 = 4CO2 + 2H2O",null,null,"2 + 5 = 4 + 2","52 + 160 =",212,null,21482]
[8,"Ethylene","C2H4 + 3O2 = 2CO2 + 2H2O",null,null,"1 + 3 = 2 + 2","28 + 96 =",124,null,21643]
[9,"Ethane","2C2H6 + 7O2 = 4CO2 + 6H2O",null,null,"2 + 7 = 4 + 6","60 + 224 =",284,null,22334]
[10,"Hydrogen Sulfide","2H2S + 3O2 = 2SO2 + 2H2O",null,null,"2 + 3 = 2 + 2","68 + 96 =",164,null,7094]
[null,"Copy Rights: Not to be copied or distributed without specific permission from Inveno Engineering LLC; kelly.paffel@invenoeng.com"]

{"sheet":"Units","index":5,"n_rows":27,"n_cols":32,"rows_kept":27,"cut":false,"hidden":true,"merged":[]}
[]
[null,{"$f":"IF( Main!P5=1, \"Unit Preferences - English\", \"Unit Preferences - Metric\")","v":"Unit Preferences - English"}]
[null,"Mass",{"$f":"IF(D3=\"lb\",1,0.45359237)","v":1},{"$f":"IF(Units_Pref=1,\"lb\",\"kg\")","v":"lb"}]
[null,"Length",{"$f":"IF(D4=\"ft\",1,0.3048)","v":1},{"$f":"IF(Units_Pref=1,\"ft\",\"m\")","v":"ft"}]
[null,"Pressure",{"$f":"IF(D5=\"psia\",1,0.06894757293)","v":1},{"$f":"IF(Units_Pref=1,\"psia\",\"bara\")","v":"psia"}]
[null,"Energy",{"$f":"IF(D6=\"Btu\",1,1.055055853)","v":1},{"$f":"IF(Units_Pref=1,\"Btu\",\"kJ\")","v":"Btu"}]
[null,"Velocity",{"$f":"IF(D7=\"ft/s\",1,0.3048)","v":1},{"$f":"IF(Units_Pref=1,\"ft/s\",\"m/s\")","v":"ft/s"}]
[]
[null,"Moisture Level Measurement Basis"]
[null,"Wet-Bulb Temperature"]
[null,"Relative Humidity"]
[]
[null,"Type of Flue Gas Measured",null,null,"Flue Gas Measurement Basis",null,null,null,"Units for Carbon Monoxide"]
[null,"Oxygen",null,null,"Dry",null,null,null,"ppm (by vol)"]
[null,"Carbon Dioxide",null,null,"Wet",null,null,null,"% Vol"]
[]
[null,"Saturation Pressure of Water",null,null,"Enthalpy for Dry Gas (255K to 1000K)",null,null,null,"Enthalpy for Dry Gas (> 1000K)",null,null,null,"Enthalpy for Flue Gas (255K to 1000K)",null,null,null,"Enthalpy for Flue Gas (> 1000K)",null,null,null,"Enthalpy for Steam/Water at 1psia (200 to 1000F)",null,null,null,null,"Enthalpy for Dry Residue (0 to 2000°F)",null,null,null,"Enthalpy for Water Vapour (0 to 1000F)"]
[null,"C1",1.9257E-2,null,"C0",null,-131.0658,null,"C0",null,-117.7723,null,"C0",null,-123.18989999999999,null,"C0",null,-118.0095,null,"C0",null,0.43290000000000001,null,null,"C0",null,0.16,null,"C0",null,0.44080000000000003]
[null,"C2",1.289016E-3,null,"C1",null,0.45813039999999999,null,"C1",null,0.37167860000000003,null,"C1",null,0.4065568,null,"C1",null,0.36350949999999999,null,"C1",null,3.9579999999999997E-5,null,null,"C1",null,1.0900000000000001E-4,null,"C1",null,2.3810000000000001E-5]
[null,"C3",1.2112200000000001E-5,null,"C2",null,-1.075033E-4,null,"C2",null,8.7019060000000006E-5,null,"C2",null,5.7950499999999997E-6,null,"C2",null,1.039228E-4,null,"C2",null,1062.2,null,null,"C2",null,2.843E-8,null,"C2",null,9.638E-9]
[null,"C4",4.5340070000000002E-7,null,"C3",null,1.778848E-7,null,"C3",null,-2.196213E-8,null,"C3",null,6.3311209999999998E-8,null,"C3",null,-2.72182E-8,null,null,null,null,null,null,"C3",null,12.95,null,"C3",null,-34.1]
[null,"C5",6.84188E-11,null,"C4",null,-9.2486639999999995E-11,null,"C4",null,2.9795619999999998E-12,null,"C4",null,-2.9244339999999999E-11,null,"C4",null,3.7182569999999998E-12]
[null,"C6",2.1970920000000001E-11,null,"C5",null,1.6820314000000001E-14,null,"C5",null,-1.6308309999999999E-16,null,"C5",null,2.491009E-15,null,"C5",null,-2.0305959999999999E-16]
[]
[null,"Options"]
[null,"Yes"]
[null,"No"]

{"sheet":"Steam Table","index":6,"n_rows":230,"n_cols":9,"rows_kept":230,"cut":false,"hidden":false,"merged":[[0,1,0,2],[0,4,0,5],[0,7,0,8],[229,1,229,8]]}
[null,"Pressure",null,"Temperature","Specific Volume",null,"Heat -BTU/lb","Enthalpy - BTU/lb"]
[null,"Gage psig","Absolute psia","Saturation Deg. F.","Water vf\nft3/lb","Steam vg\nft3/lb","Liquid hf","Lat. Heat    hfg","Total STM Heat hg"]
[null,0,14.7,212,1.6712999999999999E-2,26.789000000000001,180.33,970,{"$f":"SUM(G3:H3)","v":1150.33}]
[null,1,15.7,215.34,1.6737999999999999E-2,25.190999999999999,183.7,967.9,{"$f":"SUM(G4:H4)","v":1151.5999999999999}]
[null,2,16.7,218.51,1.6761000000000002E-2,23.779,186.89,966,1152.8899999999999]
[null,3,17.7,221.53,1.6784E-2,22.521999999999998,189.93,964.1,1154.03]
[null,4,18.7,224.4,1.6806000000000001E-2,21.393999999999998,192.83,962.3,1155.1299999999999]
[null,5,19.7,227.15,1.6827000000000002E-2,20.378,195.61,960.5,1156.1100000000001]
[null,6,20.7,229.79,1.6847999999999998E-2,19.456,198.28,958.8,1157.08]
[null,7,21.7,232.33,1.6867E-2,18.617000000000001,200.84,957.2,1158.04]
[null,8,22.7,234.77,1.6886000000000002E-2,17.849,203.31,955.6,1158.9100000000001]
[null,9,23.7,237.13,1.6905E-2,17.143999999999998,205.69,954.1,1159.79]
[null,10,24.7,239.4,1.6923000000000001E-2,16.494,207.99,952.6,1160.5900000000001]
[null,11,25.7,241.6,1.6941000000000001E-2,15.891999999999999,210.21,951.2,1161.4100000000001]
[null,12,26.7,243.74,1.6958000000000001E-2,15.335000000000001,212.37,949.8,1162.17]
[null,13,27.7,245.8,1.6974E-2,14.816000000000001,214.46,948.4,1162.8599999999999]
[null,14,28.7,247.81,1.6990999999999999E-2,14.332000000000001,216.5,947,1163.5]
[null,15,29.7,249.76,1.7006E-2,13.88,218.47,945.7,1164.17]
[null,16,30.7,251.66,1.7021999999999999E-2,13.456,220.4,944.5,1164.9000000000001]
[null,17,31.7,253.51,1.7037E-2,13.058,222.27,943.2,1165.47]
[null,18,32.700000000000003,255.31,1.7052000000000001E-2,12.683999999999999,224.1,942,1166.0999999999999]
[null,19,33.700000000000003,257.06,1.7066999999999999E-2,12.331,225.88,940.8,1166.6799999999998]
[null,20,34.700000000000003,258.77999999999997,1.7080999999999999E-2,11.997999999999999,227.62,939.6,1167.22]
[null,21,35.700000000000003,260.45,1.7094999999999999E-2,11.682,229.32,938.5,1167.82]
[null,22,36.700000000000003,262.08999999999997,1.7108999999999999E-2,11.384,230.99,937.4,1168.3899999999999]
[null,23,37.700000000000003,263.69,1.7122999999999999E-2,11.1,232.61,936.3,1168.9099999999999]
[null,24,38.700000000000003,265.25,1.7135999999999998E-2,10.831,234.21,935.2,1169.4100000000001]
[null,25,39.700000000000003,266.79000000000002,1.7149000000000001E-2,10.574999999999999,235.77,934.1,1169.8700000000001]
[null,26,40.700000000000003,268.29000000000002,1.7162E-2,10.331,237.3,933.1,1170.4000000000001]
[null,27,41.7,269.76,1.7174999999999999E-2,10.098000000000001,238.8,932,1170.8]
[null,28,42.7,271.20999999999998,1.7187999999999998E-2,9.8759999999999994,240.27,931,1171.27]
[null,29,43.7,272.63,1.72E-2,9.6639999999999997,241.71,930,1171.71]
[null,30,44.7,274.02,1.7212000000000002E-2,9.4610000000000003,243.13,929,1172.1300000000001]
[null,31,45.7,275.38,1.7224E-2,9.266,244.53,928.1,1172.6300000000001]
[null,32,46.7,276.73,1.7236000000000001E-2,9.08,245.89,927.1,1172.99]
[null,33,47.7,278.05,1.7247999999999999E-2,8.9009999999999998,247.24,926.2,1173.44]
[null,34,48.7,279.33999999999997,1.7260000000000001E-2,8.7289999999999992,248.57,925.3,1173.8699999999999]
[null,35,49.7,280.62,1.7271000000000002E-2,8.5640000000000001,249.87,924.3,1174.17]
[null,36,50.7,281.87,1.7283E-2,8.4049999999999994,251.15,923.4,1174.55]
[null,37,51.7,283.11,1.7294E-2,8.2520000000000007,252.41,922.6,1175.01]
[null,38,52.7,284.33,1.7305000000000001E-2,8.1039999999999992,253.66,921.7,1175.3600000000001]
[null,39,53.7,285.52,1.7316000000000002E-2,7.9619999999999997,254.88,920.8,1175.6799999999998]
[null,40,54.7,286.70999999999998,1.7326999999999999E-2,7.8250000000000002,256.08999999999997,919.9,1175.99]
[null,41,55.7,287.87,1.7337999999999999E-2,7.6929999999999996,257.27999999999997,919.1,1176.3800000000001]
[null,42,56.7,289.02,1.7349E-2,7.5650000000000004,258.45999999999998,918.3,1176.76]
[null,43,57.7,290.14999999999998,1.7358999999999999E-2,7.4420000000000002,259.62,917.4,{"$f":"SUM(G46:H46)","v":1177.02}]
[null,44,58.7,291.26,1.737E-2,7.3230000000000004,260.76,916.6,1177.3600000000001]
[null,45,59.7,292.36,1.738E-2,7.2069999999999999,261.89,915.8,1177.69]
[null,46,60.7,293.45,1.7391E-2,7.0949999999999998,263,915,1178]
[null,47,61.7,294.52,1.7401E-2,6.9870000000000001,264.10000000000002,914.2,1178.3000000000002]
[null,48,62.7,295.58,1.7410999999999999E-2,6.8819999999999997,265.18,913.4,1178.58]
[null,49,63.7,296.62,1.7420999999999999E-2,6.78,266.26,912.7,1178.96]
[null,50,64.7,297.64999999999998,1.7430999999999999E-2,6.6820000000000004,267.31,911.9,1179.21]
[null,51,65.7,298.67,1.7441000000000002E-2,6.5860000000000003,268.36,911.1,1179.46]
[null,52,66.7,299.68,1.7451000000000001E-2,6.4930000000000003,269.39,910.4,1179.79]
[null,53,67.7,300.67,1.7461000000000001E-2,6.4020000000000001,270.42,909.6,1180.02]
[null,54,68.7,301.64999999999998,1.7469999999999999E-2,6.3140000000000001,271.43,908.9,1180.33]
[null,55,69.7,302.62,1.7479999999999999E-2,6.2290000000000001,272.42,908.2,1180.6200000000001]
[null,56,70.7,303.58,1.7489999999999999E-2,6.1459999999999999,273.41000000000003,907.4,1180.81]
[null,57,71.7,304.52999999999997,1.7499000000000001E-2,6.0650000000000004,274.39,906.7,1181.0900000000001]
[null,58,72.7,305.47000000000003,1.7509E-2,5.9870000000000001,275.35000000000002,906,1181.3499999999999]
[null,59,73.7,306.39999999999998,1.7517999999999999E-2,5.91,276.31,905.3,1181.6099999999999]
[null,60,74.7,307.32,1.7527999999999998E-2,5.835,277.26,904.6,1181.8600000000001]
[null,61,75.7,308.23,1.7531999999999999E-2,5.7629999999999999,278.19,903.9,1182.0899999999999]
[null,62,76.7,309.12,1.7541000000000001E-2,5.6920000000000002,279.12,903.2,1182.3200000000002]
[null,63,77.7,310.01,1.755E-2,5.6230000000000002,280.04000000000002,902.5,1182.54]
[null,64,78.7,310.89,1.7559999999999999E-2,5.5549999999999997,280.94,901.9,1182.8399999999999]
[null,65,79.7,311.76,1.7569000000000001E-2,5.49,281.83999999999997,901.2,1183.04]
[null,66,80.7,312.63,1.7578E-2,5.4249999999999998,282.73,900.5,1183.23]
[null,67,81.7,313.48,1.7586999999999998E-2,5.3630000000000004,283.62,899.9,1183.52]
[null,68,82.7,314.33,1.7596000000000001E-2,5.3019999999999996,284.49,899.2,1183.69]
[null,69,83.7,315.16000000000003,1.7604999999999999E-2,5.242,285.36,898.6,1183.96]
[null,70,84.7,315.99,1.7614000000000001E-2,5.1840000000000002,286.20999999999998,897.9,1184.1099999999999]
[null,71,85.7,316.82,1.7623E-2,5.1260000000000003,287.06,897.3,1184.3599999999999]
[null,72,86.7,317.63,1.7631000000000001E-2,5.0709999999999997,287.91000000000003,896.6,1184.51]
[null,73,87.7,318.44,1.7639999999999999E-2,5.016,288.74,896,1184.74]
[null,74,88.7,319.24,1.7649000000000001E-2,4.9630000000000001,289.57,895.4,1184.97]
[null,75,89.7,320.02999999999997,1.7656999999999999E-2,4.9109999999999996,290.39,894.8,1185.19]
[null,76,90.7,320.81,1.7666000000000001E-2,4.8600000000000003,291.2,894.1,1185.3]
[null,77,91.7,321.58999999999997,1.7673999999999999E-2,4.8099999999999996,292.01,893.5,1185.51]
[null,78,92.7,322.37,1.7683000000000001E-2,4.7610000000000001,292.81,892.9,1185.71]
[null,79,93.7,323.13,1.7690999999999998E-2,4.7130000000000001,293.60000000000002,892.3,1185.9000000000001]
[null,80,94.7,323.89,1.77E-2,4.6660000000000004,294.39,891.7,1186.0900000000001]
[null,81,95.7,324.64,1.7708000000000002E-2,4.62,295.17,891.1,1186.27]
[null,82,96.7,325.39,1.7715999999999999E-2,4.5750000000000002,295.95,890.5,1186.45]
[null,83,97.7,326.13,1.7724E-2,4.5309999999999997,296.70999999999998,889.9,1186.6099999999999]
[null,84,98.7,326.86,1.7732000000000001E-2,4.4870000000000001,297.48,889.3,1186.78]
[null,85,99.7,327.58999999999997,1.7739999999999999E-2,4.4450000000000003,298.23,888.8,1187.03]
[null,86,100.7,328.31,1.7748E-2,4.4009999999999998,298.98,888.2,{"$f":"SUM(G89:H89)","v":1187.18}]
[null,87,101.7,329.03,1.7756000000000001E-2,4.3600000000000003,299.73,887.6,1187.33]
[null,88,102.7,329.74,1.7763999999999999E-2,4.32,300.47000000000003,887,1187.47]
[null,89,103.7,330.45,1.7772E-2,4.28,301.2,886.5,1187.7]
[null,90,104.7,331.15,1.7780000000000001E-2,4.242,301.93,885.9,1187.83]
[null,91,105.7,331.84,1.7788000000000002E-2,4.2039999999999997,302.66000000000003,885.4,1188.06]
[null,92,106.7,332.53,1.7795999999999999E-2,4.1669999999999998,303.37,884.8,1188.17]
[null,93,107.7,333.22,1.7804E-2,4.13,304.08999999999997,884.2,1188.29]
[null,94,108.7,333.9,1.7811E-2,4.0940000000000003,304.8,883.7,1188.5]
[null,95,109.7,334.57,1.7819000000000002E-2,4.0590000000000002,305.5,883.1,1188.5999999999999]
[null,96,110.7,335.24,1.7826999999999999E-2,4.024,306.2,882.6,1188.8]
[null,97,111.7,335.91,1.7833999999999999E-2,3.99,306.89,882.1,1188.99]
[null,98,112.7,336.57,1.7842E-2,3.9569999999999999,307.58,881.5,1189.08]
[null,99,113.7,337.22,1.7849E-2,3.9239999999999999,308.26,881,1189.26]
[null,100,114.7,337.87,1.7857000000000001E-2,3.891,308.94,880.4,1189.3399999999999]
[null,101,115.7,338.52,1.7864000000000001E-2,3.859,309.62,879.9,1189.52]
[null,102,116.7,339.16,1.7871999999999999E-2,3.8279999999999998,310.29000000000002,879.4,1189.69]
[null,103,117.7,339.8,1.7878999999999999E-2,3.7970000000000002,310.95999999999998,878.9,1189.8599999999999]
[null,104,118.7,340.43,1.7885999999999999E-2,3.7669999999999999,311.62,878.3,1189.92]
[null,105,119.7,341.06,1.7894E-2,3.7370000000000001,312.27999999999997,877.8,1190.08]
[null,106,120.7,341.69,1.7901E-2,3.7080000000000002,312.93,877.3,1190.23]
[null,107,121.7,342.31,1.7908E-2,3.6789999999999998,313.58,876.8,1190.3799999999999]
[null,108,122.7,342.93,1.7915E-2,3.65,314.23,876.3,1190.53]
[null,109,123.7,343.54,1.7922E-2,3.6219999999999999,314.87,875.8,1190.67]
[null,110,124.7,344.15,1.7930000000000001E-2,3.5950000000000002,315.51,875.3,1190.81]
[null,111,125.7,344.76,1.7937000000000002E-2,3.5680000000000001,316.14,874.8,1190.94]
[null,112,126.7,345.36,1.7944000000000002E-2,3.5409999999999999,316.77,874.3,1191.07]
[null,113,127.7,345.95,1.7951000000000002E-2,3.5139999999999998,317.39999999999998,873.8,1191.1999999999998]
[null,114,128.69999999999999,346.55,1.7957999999999998E-2,3.4889999999999999,318.02,873.3,1191.32]
[null,115,129.69999999999999,347.14,1.7964999999999998E-2,3.4630000000000001,318.64,872.8,1191.44]
[null,116,130.69999999999999,347.73,1.7971999999999998E-2,3.4380000000000002,319.26,872.3,1191.56]
[null,117,131.69999999999999,348.31,1.7978999999999998E-2,3.4129999999999998,319.87,871.8,1191.67]
[null,118,132.69999999999999,348.89,1.7985999999999999E-2,3.3879999999999999,320.48,871.3,1191.78]
[null,119,133.69999999999999,349.47,1.7992999999999999E-2,3.3639999999999999,321.08999999999997,870.8,1191.8899999999999]
[null,120,134.69999999999999,350.04,1.7999999999999999E-2,3.3410000000000002,321.69,870.3,1191.99]
[null,121,135.69999999999999,350.61,1.8006000000000001E-2,3.3170000000000002,322.29000000000002,869.9,1192.19]
[null,122,136.69999999999999,351.18,1.8013000000000001E-2,3.294,322.88,869.4,1192.28]
[null,123,137.69999999999999,351.74,1.8020000000000001E-2,3.2709999999999999,323.48,868.9,1192.3800000000001]
[null,124,138.69999999999999,352.3,1.8027000000000001E-2,3.2490000000000001,324.07,868.4,1192.47]
[null,125,139.69999999999999,352.86,1.8033E-2,3.2269999999999999,324.64999999999998,868,1192.6500000000001]
[null,126,140.69999999999999,353.41,1.804E-2,3.2050000000000001,325.23,867.5,1192.73]
[null,127,141.69999999999999,353.96,1.8047000000000001E-2,3.1829999999999998,325.81,867,1192.81]
[null,128,142.69999999999999,354.51,1.8053E-2,3.1619999999999999,326.39,866.6,1192.99]
[null,129,143.69999999999999,355.05,1.806E-2,3.141,326.95999999999998,866.1,{"$f":"SUM(G132:H132)","v":1193.06}]
[null,130,144.69999999999999,355.6,1.8067E-2,3.12,327.54000000000002,865.6,1193.1400000000001]
[null,131,145.69999999999999,356.13,1.8072999999999999E-2,3.1,328.1,865.2,1193.3000000000002]
[null,132,146.69999999999999,356.67,1.8079999999999999E-2,3.08,328.67,864.7,1193.3700000000001]
[null,133,147.69999999999999,357.2,1.8086000000000001E-2,3.06,329.23,864.2,1193.43]
[null,134,148.69999999999999,357.73,1.8093000000000001E-2,3.04,329.79,863.8,1193.5899999999999]
[null,135,149.69999999999999,358.26,1.8099000000000001E-2,3.0209999999999999,330.35,863.3,1193.6500000000001]
[null,136,150.69999999999999,358.79,1.8106000000000001E-2,3.0019999999999998,330.9,862.9,1193.8]
[null,137,151.69999999999999,359.31,1.8112E-2,2.9830000000000001,331.45,862.4,1193.8499999999999]
[null,138,152.69999999999999,359.83,1.8119E-2,2.964,332,862,1194]
[null,139,153.69999999999999,360.34,1.8124999999999999E-2,2.9460000000000002,332.54,861.5,1194.04]
[null,140,154.69999999999999,360.86,1.8131999999999999E-2,2.9279999999999999,333.09,861.1,1194.19]
[null,141,155.69999999999999,361.37,1.8138000000000001E-2,2.91,333.63,860.7,1194.33]
[null,142,156.69999999999999,361.88,1.8144E-2,2.8919999999999999,334.17,860.2,1194.3700000000001]
[null,143,157.69999999999999,362.38,1.8151E-2,2.8740000000000001,334.7,859.8,1194.5]
[null,144,158.69999999999999,362.89,1.8157E-2,2.8570000000000002,335.23,859.3,1194.53]
[null,145,159.69999999999999,363.39,1.8162999999999999E-2,2.84,335.77,858.9,1194.67]
[null,146,160.69999999999999,363.89,1.8169000000000001E-2,2.823,336.29,858.5,1194.79]
[null,147,161.69999999999999,364.38,1.8176000000000001E-2,2.806,336.82,858,1194.82]
[null,148,162.69999999999999,364.88,1.8182E-2,2.79,337.34,857.6,1194.94]
[null,149,163.69999999999999,365.37,1.8187999999999999E-2,2.7730000000000001,337.86,857.2,1195.06]
[null,150,164.7,365.86,1.8193999999999998E-2,2.7570000000000001,338.38,856.7,1195.08]
[null,152,166.7,366.83,1.8207000000000001E-2,2.726,339.41,855.9,1195.31]
[null,154,168.7,367.79,1.8218999999999999E-2,2.6949999999999998,340.43,855.1,1195.53]
[null,156,170.7,368.74,1.8231000000000001E-2,2.6640000000000001,341.44,854.2,1195.6400000000001]
[null,158,172.7,369.69,1.8242999999999999E-2,2.6349999999999998,342.45,853.4,1195.8499999999999]
[null,160,174.7,370.62,1.8255E-2,2.6059999999999999,343.44,852.5,1195.94]
[null,162,176.7,371.55,1.8266999999999999E-2,2.577,344.43,851.7,1196.1300000000001]
[null,164,178.7,372.47,1.8279E-2,2.5499999999999998,345.41,850.9,1196.31]
[null,166,180.7,373.38,1.8291000000000002E-2,2.5230000000000001,346.38,850.1,1196.48]
[null,168,182.7,374.29,1.8303E-2,2.496,347.34,849.3,1196.6399999999999]
[null,170,184.7,375.18,1.8314E-2,2.4700000000000002,348.3,848.5,1196.8]
[null,172,186.7,376.07,1.8325999999999999E-2,2.4449999999999998,349.24,847.7,1196.94]
[null,174,188.7,376.95,1.8338E-2,2.42,350.18,846.9,1197.08]
[null,175,189.7,377.51,1.8343999999999999E-2,2.4129999999999998,350.8,846.5,1197.3]
[null,176,190.7,377.82,1.8349000000000001E-2,2.395,351.12,846.1,1197.22]
[null,178,192.7,378.69,1.8360999999999999E-2,2.371,352.04,845.3,1197.3399999999999]
[null,180,194.7,379.55,1.8371999999999999E-2,2.3479999999999999,352.96,844.6,1197.56]
[null,182,196.7,380.4,1.8383E-2,2.3250000000000002,353.87,843.8,1197.67]
[null,184,198.7,381.25,1.8395000000000002E-2,2.302,354.78,843,1197.78]
[null,186,200.7,382.09,1.8405999999999999E-2,2.2799999999999998,355.68,842.9,1198.58]
[null,188,202.7,382.92,1.8416999999999999E-2,2.258,356.57,842.2,1198.77]
[null,190,204.7,383.75,1.8428E-2,2.2370000000000001,357.45,841.4,1198.8499999999999]
[null,192,206.7,384.57,1.8439000000000001E-2,2.2160000000000002,358.33,840.6,{"$f":"SUM(G175:H175)","v":1198.93}]
[null,194,208.7,385.38,1.8450000000000001E-2,2.1960000000000002,359.21,839.9,1199.1099999999999]
[null,196,210.7,386.19,1.8461000000000002E-2,2.1749999999999998,360.07,839.1,1199.17]
[null,198,212.7,386.99,1.8471999999999999E-2,2.1560000000000001,360.94,838.4,1199.3399999999999]
[null,200,214.7,387.79,1.8482999999999999E-2,2.1360000000000001,361.79,837.7,1199.49]
[null,205,219.7,389.75,1.8509999999999999E-2,2.089,363.91,835.8,1199.71]
[null,210,224.7,391.68,1.8537000000000001E-2,2.044,365.99,834,1199.99]
[null,215,229.7,393.58,1.8563E-2,2.0009999999999999,368.03,832.2,1200.23]
[null,220,234.7,395.44,1.8589999999999999E-2,1.96,370.05,830.4,1200.45]
[null,225,239.7,397.28,1.8616000000000001E-2,1.92,372.03,828.7,1200.73]
[null,230,244.7,399.08,1.8641000000000001E-2,1.8819999999999999,373.99,826.9,1200.8899999999999]
[null,235,249.7,400.86,1.8667E-2,1.845,375.92,825.2,1201.1200000000001]
[null,240,254.7,402.61,1.8692E-2,1.81,377.82,823.5,1201.32]
[null,245,259.7,404.33,1.8717000000000001E-2,1.776,379.69,821.8,1201.49]
[null,250,264.7,406.03,1.8742000000000002E-2,1.7430000000000001,381.54,820.2,1201.74]
[null,255,269.7,407.7,1.8766999999999999E-2,1.7110000000000001,383.36,818.5,1201.8600000000001]
[null,260,274.7,409.35,1.8790999999999999E-2,1.681,385.16,816.9,1202.06]
[null,265,279.7,410.97,1.8815999999999999E-2,1.6519999999999999,386.94,815.3,1202.24]
[null,270,284.7,412.58,1.8839999999999999E-2,1.623,388.69,813.7,1202.3900000000001]
[null,275,289.7,414.16,1.8863999999999999E-2,1.5960000000000001,390.42,812.1,1202.52]
[null,280,294.7,415.72,1.8887000000000001E-2,1.569,392.14,810.5,1202.6399999999999]
[null,285,299.7,417.26,1.8911000000000001E-2,1.544,393.83,809,1202.83]
[null,290,304.7,418.78,1.8933999999999999E-2,1.5189999999999999,395.5,807.5,1203]
[null,295,309.7,420.28,1.8957999999999999E-2,1.4950000000000001,397.15,805.9,1203.05]
[null,300,314.7,421.76,1.8981000000000001E-2,1.4710000000000001,398.79,804.4,1203.19]
[null,310,324.7,424.67,1.9026999999999999E-2,1.427,402.01,801.4,1203.4099999999999]
[null,320,334.7,427.51,1.9071999999999999E-2,1.385,405.15,798.5,1203.6500000000001]
[null,330,344.7,430.29,1.9116999999999999E-2,1.345,408.24,795.6,1203.8400000000001]
[null,340,354.7,433,1.9161000000000001E-2,1.3080000000000001,411.26,792.7,1203.96]
[null,350,364.7,435.66,1.9205E-2,1.272,414.22,789.9,1204.1199999999999]
[null,360,374.7,438.26,1.9248000000000001E-2,1.2390000000000001,417.13,787.1,1204.23]
[null,370,384.7,440.8,1.9290999999999999E-2,1.2070000000000001,419.99,784.3,1204.29]
[null,380,394.7,443.3,1.9334E-2,1.177,422.8,781.6,1204.4000000000001]
[null,390,404.7,445.75,1.9376000000000001E-2,1.1479999999999999,425.25,779,1204.25]
[null,400,414.7,448.15,1.9418000000000001E-2,1.1200000000000001,427.94,776.3,1204.24]
[null,410,424.7,450.51,1.9459000000000001E-2,1.0940000000000001,430.59,773.7,1204.29]
[null,420,434.7,452.82,1.95E-2,1.0680000000000001,433.2,771.1,1204.3]
[null,430,444.7,455.09,1.9540999999999999E-2,1.044,435.77,768.5,1204.27]
[null,440,454.7,457.33,1.9581999999999999E-2,1.0209999999999999,438.3,766,1204.3]
[null,450,464.7,459.52,1.9622000000000001E-2,0.999,440.8,763.5,1204.3]
[null,460,474.7,461.68,1.9661999999999999E-2,0.97799999999999998,443.25,761,1204.25]
[null,470,484.7,463.81,1.9702000000000001E-2,0.95699999999999996,445.68,758.5,1204.18]
[null,480,494.7,465.9,1.9741000000000002E-2,0.93799999999999994,448.07,756.1,1204.17]
[null,490,504.7,467.97,1.9781E-2,0.91900000000000004,450.43,753.7,{"$f":"SUM(G218:H218)","v":1204.1300000000001}]
[null,500,514.70000000000005,470,1.9820000000000001E-2,0.90100000000000002,452.76,751.3,1204.06]
[null,510,524.70000000000005,472,1.9859000000000002E-2,0.88300000000000001,455.06,748.9,1203.96]
[null,520,534.70000000000005,473.97,1.9897000000000001E-2,0.86599999999999999,457.33,746.6,1203.93]
[null,530,544.70000000000005,475.91,1.9935999999999999E-2,0.85,459.58,744.2,1203.78]
[null,540,554.70000000000005,477.82,1.9973999999999999E-2,0.83399999999999996,461.79,741.9,1203.69]
[null,550,564.70000000000005,479.71,2.0011999999999999E-2,0.81899999999999995,463.99,739.6,1203.5900000000001]
[null,560,574.70000000000005,481.57,2.0049999999999998E-2,0.80500000000000005,466.15,737.3,1203.4499999999998]
[null,570,584.70000000000005,483.41,2.0088000000000002E-2,0.79,468.3,735,1203.3]
[null,580,594.70000000000005,485.23,2.0126000000000002E-2,0.77700000000000002,470.42,732.8,1203.22]
[null,590,604.70000000000005,487.02,2.0164000000000001E-2,0.76300000000000001,472.52,730.5,1203.02]
[null,600,614.70000000000005,488.79,2.0201E-2,0.751,474.59,728.3,1202.8899999999999]
[null,"Copy Rights: Not to be copied or distributed without specific permission from Inveno Engineering LLC; kelly.paffel@invenoeng.com"]