{"text_format":"1","workbook":"xlsx","n_sheets":7,"sheets":["Main","Blank for Calculation","Excess Air","Fuel","Combustion","Units","Steam Table"],"not_rendered":{"charts":0,"images":1,"macros":1,"external_links":0,"defined_names":190,"comments":2,"pivot_tables":0},"unopened":[],"bounds":{"document_bytes":16777216,"sheet_cells":100000,"rows_first":2000,"rows_last":500,"rows_between":2000,"halvings":0,"cell_chars":16384,"cell_head_chars":4096},"cells_cut":0,"cells_raw":0,"read":"whole","date_system":"1900"}

{"sheet":"Main","index":0,"n_rows":138,"n_cols":31,"rows_kept":138,"cut":false,"hidden":false,"merged":[[5,3,5,6],[6,3,6,6],[7,3,7,6],[1,1,1,11],[16,13,17,13],[16,5,16,6],[16,7,16,8],[8,3,8,6],[3,9,3,10],[6,9,6,11],[7,9,7,11],[8,9,8,11],[3,3,3,6],[4,3,4,6],[119,5,120,6],[119,7,120,7],[32,13,32,25],[30,7,31,11],[9,26,9,27],[16,14,17,14],[16,18,16,24],[16,15,17,15],[16,16,17,16],[16,17,17,17]]}
[]
[null,"BOILER EFFICIENCY CALCULATION \n(PER ASME PTC 4)"]
[]
[null,"Client:",null,"Sample company",null,null,null,null,"Date:","2017-05-30",null,null,null,null,"Selection Basis"]
[null,"Plant Location:",null,"Sample location",null,null,null,null,null,null,null,null,null,null,"Unit Preference",1,"1: English 2: Metric"]
[null,null,null,"WI",null,null,null,null,null,null,null,null,null,null,"Moisture Measurement Basis",1,"1: Wet-bulb 2: Relative Humidity"]
[null,"Contact Person:",null,"XXXXX",null,null,null,null,"Engineer:","Kelly Paffel",null,null,null,null,"Flue Gas Measurement Basis",1,"1: Dry 2: Wet",null,null,null,null,null,null,null,null,null,null,null,null,"Unit Conversion: 1 English unit to SI unit"]
[null,"Email:",null,null,null,null,null,null,"Email:","Kelly.paffel@invenoeng.com",null,null,null,null,"Type of Gas Measured in Flue",1,"1: Oxygen 2: Carbon Dioxide",null,null,null,null,null,null,null,null,null,"Previous Units:",2,null,0.45359237000000002,"kg"]
[null,"Contact Number:",null,null,null,null,null,null,"Contact No.:","239-289-3667",null,null,null,null,"Unit for Carbon Monoxide",1,"1: ppm 2: % Vol",null,null,null,null,null,null,null,null,null,1,2,null,0.30480000000000002,"m"]
[null,null,null,null,null,null,null,null,null,null,null,null,null,null,"Ash Residue",2,"1: Yes 2: No",null,null,null,null,null,null,null,null,null,"For Unit Conversion",null,null,6.8947572930000006E-2,"bara"]
[null,"Fuel Data",null,null,null,null,null,null,null,null,null,null,null,null,"Fuel Type",8,{"$f":"\"1: \"&Fuel!B4 & \" 2: \"&Fuel!B5 & \" 3: \"&Fuel!B6 & \" 4: \"&Fuel!B7 & \" 5: \"&Fuel!B8 & \" 6: \"&Fuel!B9 & \" 7: \"&Fuel!B10 & \" 8: \"&Fuel!B11 & \" 9: \"& \"Blank\"","v":"1: Coal 2: Diesel 3: Fuel No.2 4: Fuel No.6 5: Gasoline 6: Heavy Fuel oil 7: Kerosene 8: Natural Gas 9: Blank"},null,null,null,null,null,null,null,null,null,"English","Metric",null,1.055055853,"kJ"]
[null,null,"Fuel Type:",null,null,null,null,null,null,null,null,{"$f":"IF(Fuel_Type=9,\"¬\",\"\")","v":""}]
[null,null,"Fuel Input:",null,null,11000,{"$f":"IF(Units_Pref=1,\"lb/h\",\"kg/h\")","v":"lb/h"},null,null,null,null,{"$f":"IF(ISBLANK(F13),\"¬\",\"\")","v":""},null,null,null,null,null,"Mass % (Ultimate Analysis):",{"$f":"IF(SUM($S$14:$Y$14)=0,0,S14/SUM($S$14:$Y$14)*100)","v":66.943853979732154},{"$f":"IF(SUM($S$14:$Y$14)=0,0,T14/SUM($S$14:$Y$14)*100)","v":21.136484538653917},0,0,0,0,11.919661481613923,null,{"$f":"IF(Units_Pref=AA$9,$F13,$F13/Unit_Preference_Mass)","v":11000},{"$f":"IF(Units_Pref=AB$9,$F13,$F13*Unit_Preference_Mass_SI)","v":4989.5160700000006}]
[null,null,"Fuel High Heating Value (HHV):",null,null,14100,{"$f":"IF(Units_Pref=1,\"Btu/lb\",\"kJ/kg\")","v":"Btu/lb"},"- by lab GC analysis",null,null,null,{"$f":"IF(ISBLANK(F14),\"¬\",\"\")","v":""},null,null,null,null,null,"Mass:",{"$f":"S15*S16","v":1213.1109999999999},{"$f":"T15*T16","v":383.02099999999996},0,0,0,0,216,null,{"$f":"IF(Units_Pref=AA$9,$F14,$F14*Unit_Preference_Mass/Unit_Preference_Energy)","v":14100},{"$f":"IF(Units_Pref=AB$9,$F14,$F14*Unit_Preference_Energy_SI/Unit_Preference_Mass_SI)","v":32796.60001181237}]
[null,null,"Unburned Carbon Loss:",null,null,0.4,"% of Fuel Input",null,null,null,null,{"$f":"IF(ISBLANK(F15),\"¬\",\"\")","v":""},null,null,null,null,null,"Moles:",{"$f":"SUMPRODUCT($P$19:$P$28,S19:S28)","v":101},{"$f":"SUMPRODUCT($P$19:$P$28,T19:T28)","v":190},0,0,0,0,6]
[null,null,null,null,null,null,null,null,null,null,null,null,null,null,null,{"$f":"SUM(P19:P28)","v":100},null,"M.W:",{"$f":"IF(S18>0,VLOOKUP(S18,Combustion!$C$7:$AG$41,2,FALSE),\"\")","v":12.010999999999999},{"$f":"IF(T18>0,VLOOKUP(T18,Combustion!$C$7:$AG$41,2,FALSE),\"\")","v":2.0158999999999998},{"$f":"IF(U18>0,VLOOKUP(U18,Combustion!$C$7:$AG$41,2,FALSE),\"\")","v":32.066000000000003},{"$f":"IF(V18>0,VLOOKUP(V18,Combustion!$C$7:$AG$41,2,FALSE),\"\")","v":31.998799999999999},{"$f":"IF(W18>0,VLOOKUP(W18,Combustion!$C$7:$AG$41,2,FALSE),\"\")","v":28.013400000000001},{"$f":"IF(X18>0,VLOOKUP(X18,Combustion!$C$7:$AG$41,2,FALSE),\"\")","v":18.0153},{"$f":"IF(Y18>0,VLOOKUP(Y18,Combustion!$C$7:$AG$41,2,FALSE),\"\")","v":36}]
[null,null,"Ultimate Analysis",null,null,{"$f":"IF(Units_Pref=1,\"Theo. Air lb/ 100 lb Fuel\",\"Theo. Air kg/ 100 kg Fuel\")","v":"Theo. Air lb/ 100 lb Fuel"},null,{"$f":"IF(Units_Pref=1,\"H2O lb/ 100 lb Fuel\",\"H2O kg/ 100 kg Fuel\")","v":"H2O lb/ 100 lb Fuel"},null,null,null,null,null,"No.","Compound","Vol%","Chem. Formula","M.W","Elemental Breakdown"]
[null,null,"Constituent","M.W","Mass %","Constant","Amount","Constant","Amount",null,null,null,null,null,null,null,null,null,"C","H2","S","O2","N2","H2O","Ash"]
[null,null,"C",{"$f":"VLOOKUP(C19,Combustion!$C$7:$D$39,2,FALSE)","v":12.010999999999999},80.31,{"$f":"1*Combustion!$D$40/Combustion!$AD$40/D19","v":11.512132529649152},{"$f":"E19*F19","v":924.5393634561234},null,null,null,null,{"$f":"IF(ISBLANK(E19),\"¬\",\"\")","v":""},null,"N19","Methane",90,{"$f":"IF($O19>0,VLOOKUP($O19,Combustion!$B$7:$AG$41,2,FALSE),\"\")","v":"CH4"},{"$f":"IF($O19>0,VLOOKUP($O19,Combustion!$B$7:$AG$41,3,FALSE),\"\")","v":16.0428},{"$f":"IF($O19>0,VLOOKUP($O19,Combustion!$B$7:$AG$41,26,FALSE),\"\")","v":1},{"$f":"IF($O19>0,VLOOKUP($O19,Combustion!$B$7:$AG$41,27,FALSE),\"\")","v":2},{"$f":"IF($O19>0,VLOOKUP($O19,Combustion!$B$7:$AG$41,28,FALSE),\"\")","v":0},{"$f":"IF($O19>0,VLOOKUP($O19,Combustion!$B$7:$AG$41,29,FALSE),\"\")","v":0},{"$f":"IF($O19>0,VLOOKUP($O19,Combustion!$B$7:$AG$41,30,FALSE),\"\")","v":0},{"$f":"IF($O19>0,VLOOKUP($O19,Combustion!$B$7:$AG$41,31,FALSE),\"\")","v":0},{"$f":"IF($O19>0,VLOOKUP($O19,Combustion!$B$7:$AG$41,32,FALSE),\"\")","v":0}]
[null,null,"H2",{"$f":"VLOOKUP(C20,Combustion!$C$7:$D$39,2,FALSE)","v":2.0158999999999998},4.47,{"$f":"0.5*Combustion!$D$40/Combustion!$AD$40/D20","v":34.295407464064681},{"$f":"E20*F20","v":153.30047136436912},{"$f":"1/D20*Combustion!$D$39","v":8.9366039982141974},{"$f":"H20*E20","v":39.946619872017457},null,null,"",null,"N20","Propane",2,{"$f":"IF($O20>0,VLOOKUP($O20,Combustion!$B$7:$AG$41,2,FALSE),\"\")","v":"C3H8"},{"$f":"IF($O20>0,VLOOKUP($O20,Combustion!$B$7:$AG$41,3,FALSE),\"\")","v":44.096600000000002},{"$f":"IF($O20>0,VLOOKUP($O20,Combustion!$B$7:$AG$41,26,FALSE),\"\")","v":3},{"$f":"IF($O20>0,VLOOKUP($O20,Combustion!$B$7:$AG$41,27,FALSE),\"\")","v":4},{"$f":"IF($O20>0,VLOOKUP($O20,Combustion!$B$7:$AG$41,28,FALSE),\"\")","v":0},{"$f":"IF($O20>0,VLOOKUP($O20,Combustion!$B$7:$AG$41,29,FALSE),\"\")","v":0},{"$f":"IF($O20>0,VLOOKUP($O20,Combustion!$B$7:$AG$41,30,FALSE),\"\")","v":0},{"$f":"IF($O20>0,VLOOKUP($O20,Combustion!$B$7:$AG$41,31,FALSE),\"\")","v":0},{"$f":"IF($O20>0,VLOOKUP($O20,Combustion!$B$7:$AG$41,32,FALSE),\"\")","v":0}]
{"$rows_left_out":119}
{"sheet":"Blank for Calculation","index":1,"n_rows":3,"n_cols":1,"rows_kept":3,"cut":false,"hidden":false,"merged":[]}
["User Calculations Sheet"]
[]
["This is a blank sheet provided for the user to make notes, carry out calculations etc."]

{"sheet":"Excess Air","index":2,"n_rows":104,"n_cols":3,"rows_kept":104,"cut":false,"hidden":false,"merged":[[103,1,103,2]]}
[null,"Percent of Excess Air based on Oxygen Content in Flue Gas"]
[null,"Oxygen Content in Flue Gas","Excess Air \nPercent"]
[null,0,{"$f":"100*B3*(MoDPc+Combustion!$AE$40*MoThACr)/MoThACr/(Combustion!$AD$40*100-B3*100)","v":0}]
[null,1E-3,{"$f":"100*B4*(MoDPc+Combustion!$AE$40*MoThACr)/MoThACr/(Combustion!$AD$40*100-B4*100)","v":4.6703021064762665E-3}]
[null,2E-3,{"$f":"100*B5*(MoDPc+Combustion!$AE$40*MoThACr)/MoThACr/(Combustion!$AD$40*100-B5*100)","v":9.3856278522707268E-3}]
[null,3.0000000000000001E-3,{"$f":"100*B6*(MoDPc+Combustion!$AE$40*MoThACr)/MoThACr/(Combustion!$AD$40*100-B6*100)","v":1.4146631460564404E-2}]
[null,4.0000000000000001E-3,{"$f":"100*B7*(MoDPc+Combustion!$AE$40*MoThACr)/MoThACr/(Combustion!$AD$40*100-B7*100)","v":1.8953979891288667E-2}]
[null,5.0000000000000001E-3,{"$f":"100*B8*(MoDPc+Combustion!$AE$40*MoThACr)/MoThACr/(Combustion!$AD$40*100-B8*100)","v":2.3808353152598122E-2}]
[null,6.0000000000000001E-3,{"$f":"100*B9*(MoDPc+Combustion!$AE$40*MoThACr)/MoThACr/(Combustion!$AD$40*100-B9*100)","v":2.871044462152882E-2}]
[null,7.0000000000000001E-3,{"$f":"100*B10*(MoDPc+Combustion!$AE$40*MoThACr)/MoThACr/(Combustion!$AD$40*100-B10*100)","v":3.3660961374159325E-2}]
[null,8.0000000000000002E-3,{"$f":"100*B11*(MoDPc+Combustion!$AE$40*MoThACr)/MoThACr/(Combustion!$AD$40*100-B11*100)","v":3.8660624525604786E-2}]
[null,8.9999999999999993E-3,{"$f":"100*B12*(MoDPc+Combustion!$AE$40*MoThACr)/MoThACr/(Combustion!$AD$40*100-B12*100)","v":4.3710169580187475E-2}]
[null,0.01,{"$f":"100*B13*(MoDPc+Combustion!$AE$40*MoThACr)/MoThACr/(Combustion!$AD$40*100-B13*100)","v":4.8810346792140899E-2}]
[null,1.0999999999999999E-2,{"$f":"100*B14*(MoDPc+Combustion!$AE$40*MoThACr)/MoThACr/(Combustion!$AD$40*100-B14*100)","v":5.3961921537218918E-2}]
[null,1.2E-2,{"$f":"100*B15*(MoDPc+Combustion!$AE$40*MoThACr)/MoThACr/(Combustion!$AD$40*100-B15*100)","v":5.916567469559661E-2}]
[null,1.2999999999999999E-2,{"$f":"100*B16*(MoDPc+Combustion!$AE$40*MoThACr)/MoThACr/(Combustion!$AD$40*100-B16*100)","v":6.4422403046465196E-2}]
[null,1.4E-2,{"$f":"100*B17*(MoDPc+Combustion!$AE$40*MoThACr)/MoThACr/(Combustion!$AD$40*100-B17*100)","v":6.973291967473956E-2}]
[null,1.4999999999999999E-2,{"$f":"100*B18*(MoDPc+Combustion!$AE$40*MoThACr)/MoThACr/(Combustion!$AD$40*100-B18*100)","v":7.5098054390314903E-2}]
[null,1.6E-2,{"$f":"100*B19*(MoDPc+Combustion!$AE$40*MoThACr)/MoThACr/(Combustion!$AD$40*100-B19*100)","v":8.0518654160326067E-2}]
[null,1.7000000000000001E-2,{"$f":"100*B20*(MoDPc+Combustion!$AE$40*MoThACr)/MoThACr/(Combustion!$AD$40*100-B20*100)","v":8.5995583554882696E-2}]
{"$rows_left_out":85}
{"sheet":"Fuel","index":3,"n_rows":12,"n_cols":4,"rows_kept":12,"cut":false,"hidden":false,"merged":[[1,2,1,3],[1,1,2,1],[11,1,11,3]]}
[]
[null,"Fuel","Density"]
[null,null,"lb/ft3","kg/m3"]
[null,"Coal"]
[null,"Diesel",3.5270000000000001,{"$f":"C5*16.01846337","v":56.497120305990002}]
[null,"Fuel No.2",57.4,919.4597974379999]
[null,"Fuel No.6",59.9,959.50595586299994]
[null,"Gasoline",44.9,719.2290053129999]
[null,"Heavy Fuel oil",58,929.07087545999991]
[null,"Kerosene",49.9,799.32132216299999]
[null,"Natural Gas",4.3394999999999996E-2,0.69512121794114989]
[null,"Copy Rights: Not to be copied or distributed without specific permission from Inveno Engineering LLC; kelly.paffel@invenoeng.com"]

{"sheet":"Combustion","index":4,"n_rows":66,"n_cols":33,"rows_kept":66,"cut":false,"hidden":false,"merged":[[3,32,4,32],[2,26,2,32],[54,8,54,10],[3,31,4,31],[3,26,4,26],[3,27,4,27],[3,28,4,28],[3,29,4,29],[3,30,4,30],[44,1,44,9],[3,14,3,17],[3,21,3,24],[3,6,4,6],[54,6,54,7],[54,2,54,4],[2,7,2,10],[3,9,3,10],[3,18,3,20],[3,3,4,3],[3,2,4,2],[2,11,2,17],[2,18,2,24],[3,11,3,13],[3,7,3,8],[65,1,65,9],[3,0,4,0],[3,4,4,4],[3,5,4,5],[3,25,4,25],[3,1,4,1],[55,2,55,4],[56,2,56,4],[57,2,57,4],[63,2,63,4],[64,2,64,4],[58,2,58,4],[59,2,59,4],[60,2,60,4],[61,2,61,4],[62,2,62,4]]}
[null,1,2,3,4,5,6,7,8,9,10,11,12,13,14,15,16,17,18,19,20,21,22,23,24,25,26,27,28,29,30,31]
["(Source) Table 1 : Combustion Constants - Combustion Engineering Chapter 10"]
[null,null,null,null,null,null,null,"Heat of Combustion c",null,null,null,"ft³ per ft³ of Combustible",null,null,null,null,null,null,"lb per lb of Combustible",null,null,null,null,null,null,null,"Elemental Breakdown"]
["No.","Substance","Formula  ","Molecular Weight a","Density b (lb/ft³)","Specific Volume b (ft³/lb)","Specific Gravity b (air=1)","Btu per ft³",null,"Btu per lb",null,"Required for Combustion",null,null,"Flue Products",null,null,null,"Required for Combustion",null,null,"Flue Products",null,null,null,"Theor air lb/ 10000 Btu","C","H2","S","O2","N2","H2O","Ash"]
[null,null,null,null,null,null,null,"Gross d ","Net e  ","Gross d ","Net e  ","O2","N2 a","Air","CO2","H2O ","N2 a","SO2","O2","N2 a","Air","CO2","H2O ","N2 a","SO2"]
[]
[1,"Carbon","C",12.010999999999999,null,null,null,null,null,14093,14093,1,3.7730000000000001,4.7729999999999997,1,null,3.7730000000000001,null,2.6640000000000001,8.8460000000000001,11.51,3.6640000000000001,null,8.8460000000000001,null,8.1669999999999998,1]
[2,"Hydrogen","H2",2.0158999999999998,5.3E-3,188.245,6.9599999999999995E-2,324.2,273.89999999999998,61029,51558,0.5,1.887,2.387,null,1,1.887,null,7.9359999999999999,26.353000000000002,34.29,null,8.9369999999999994,26.353000000000002,null,5.6189999999999998,null,1]
[3,"Oxygen","O2",31.998799999999999,8.4400000000000003E-2,11.85,1.1052999999999999,null,null,null,null,null,null,null,null,null,null,null,null,null,null,null,null,null,null,null,null,null,null,1]
[4,"Nitrogen","N2",28.013400000000001,7.3800000000000004E-2,13.542999999999999,0.96709999999999996,null,null,null,null,null,null,null,null,null,null,null,null,null,null,null,null,null,null,null,null,null,null,null,1]
[4,"Nitrogen (atm.)","N2a",28.158000000000001,7.4200000000000002E-2,13.474,0.97199999999999998,null,null,null,null,null,null,null,null,null,null,null,null,null,null,null,null,null,null,null,null,null,null,null,1]
[5,"Carbon Monoxide","CO",28.010400000000001,7.3800000000000004E-2,13.542,0.96719999999999995,320.60000000000002,320.60000000000002,4342,4342,0.5,1.887,2.387,1,null,1.887,null,0.57099999999999995,1.897,2.468,1.571,null,1.897,null,5.6840000000000002,1,null,null,0.5]
[6,"Carbon Dioxide","CO2",44.009799999999998,0.1166,8.5739999999999998,1.5277000000000001,null,null,null,null,null,null,null,null,null,null,null,null,null,null,null,null,null,null,null,1,null,null,1]
[7,"Methane","CH4",16.0428,4.24E-2,23.608000000000001,0.55479999999999996,1012,911,23891,21511,2,7.5469999999999997,9.5470000000000006,1,2,7.5469999999999997,null,3.9889999999999999,13.246,17.234999999999999,2.7429999999999999,2.246,13.246,null,7.2140000000000004,1,2]
[8,"Ethane","C2H6",30.069700000000001,7.9899999999999999E-2,12.513999999999999,1.0466,1785,1634,22334,20429,3.5,13.206,16.706,2,3,13.206,null,3.7240000000000002,12.367000000000001,16.091999999999999,2.927,1.7969999999999999,12.367000000000001,null,7.2050000000000001,2,3]
[9,"Propane","C3H8",44.096600000000002,0.1183,8.4559999999999995,1.5488999999999999,2561,2359,21653,19921,5,18.866,23.866,3,4,18.866,null,3.6280000000000001,12.047000000000001,15.676,2.9940000000000002,1.6339999999999999,12.047000000000001,null,7.2389999999999999,3,4]
[10,"n-Butane","C4H10",58.1235,0.1585,6.31,2.0758000000000001,3376,3124,21299,19657,6.5,24.526,31.026,4,5,24.526,null,3.5779999999999998,11.882,15.46,3.0289999999999999,1.55,11.882,null,7.2590000000000003,4,5]
[11,"Isobutane","C4H10,iso",58.1235,0.158,6.3280000000000003,2.0699000000000001,3355,3104,21231,19589,6.5,24.526,31.026,4,5,24.526,null,3.5779999999999998,11.882,15.46,3.0289999999999999,1.55,11.882,null,7.282,4,5]
[12,"n-Pentane","C5H12",72.150400000000005,0.2019,4.952,2.645,4258,3956,21085,19498,8,30.186,38.186,5,6,30.186,null,3.548,11.781000000000001,15.329000000000001,3.05,1.498,11.781000000000001,null,7.27,5,6]
[13,"Isopentane","C5H12,iso",72.150400000000005,0.2001,4.9989999999999997,2.6202000000000001,4210,3908,21043,19455,8,30.186,38.186,5,6,30.186,null,3.548,11.781000000000001,15.329000000000001,3.05,1.498,11.781000000000001,null,7.2839999999999998,5,6]
{"$rows_left_out":47}
{"sheet":"Units","index":5,"n_rows":27,"n_cols":32,"rows_kept":27,"cut":false,"hidden":true,"merged":[]}
[]
[null,{"$f":"IF( Main!P5=1, \"Unit Preferences - English\", \"Unit Preferences - Metric\")","v":"Unit Preferences - English"}]
[null,"Mass",{"$f":"IF(D3=\"lb\",1,0.45359237)","v":1},{"$f":"IF(Units_Pref=1,\"lb\",\"kg\")","v":"lb"}]
[null,"Length",{"$f":"IF(D4=\"ft\",1,0.3048)","v":1},{"$f":"IF(Units_Pref=1,\"ft\",\"m\")","v":"ft"}]
[null,"Pressure",{"$f":"IF(D5=\"psia\",1,0.06894757293)","v":1},{"$f":"IF(Units_Pref=1,\"psia\",\"bara\")","v":"psia"}]
[null,"Energy",{"$f":"IF(D6=\"Btu\",1,1.055055853)","v":1},{"$f":"IF(Units_Pref=1,\"Btu\",\"kJ\")","v":"Btu"}]
[null,"Velocity",{"$f":"IF(D7=\"ft/s\",1,0.3048)","v":1},{"$f":"IF(Units_Pref=1,\"ft/s\",\"m/s\")","v":"ft/s"}]
[]
[null,"Moisture Level Measurement Basis"]
[null,"Wet-Bulb Temperature"]
[null,"Relative Humidity"]
[]
[null,"Type of Flue Gas Measured",null,null,"Flue Gas Measurement Basis",null,null,null,"Units for Carbon Monoxide"]
[null,"Oxygen",null,null,"Dry",null,null,null,"ppm (by vol)"]
[null,"Carbon Dioxide",null,null,"Wet",null,null,null,"% Vol"]
[]
[null,"Saturation Pressure of Water",null,null,"Enthalpy for Dry Gas (255K to 1000K)",null,null,null,"Enthalpy for Dry Gas (> 1000K)",null,null,null,"Enthalpy for Flue Gas (255K to 1000K)",null,null,null,"Enthalpy for Flue Gas (> 1000K)",null,null,null,"Enthalpy for Steam/Water at 1psia (200 to 1000F)",null,null,null,null,"Enthalpy for Dry Residue (0 to 2000°F)",null,null,null,"Enthalpy for Water Vapour (0 to 1000F)"]
[null,"C1",1.9257E-2,null,"C0",null,-131.0658,null,"C0",null,-117.7723,null,"C0",null,-123.18989999999999,null,"C0",null,-118.0095,null,"C0",null,0.43290000000000001,null,null,"C0",null,0.16,null,"C0",null,0.44080000000000003]
[null,"C2",1.289016E-3,null,"C1",null,0.45813039999999999,null,"C1",null,0.37167860000000003,null,"C1",null,0.4065568,null,"C1",null,0.36350949999999999,null,"C1",null,3.9579999999999997E-5,null,null,"C1",null,1.0900000000000001E-4,null,"C1",null,2.3810000000000001E-5]
[null,"C3",1.2112200000000001E-5,null,"C2",null,-1.075033E-4,null,"C2",null,8.7019060000000006E-5,null,"C2",null,5.7950499999999997E-6,null,"C2",null,1.039228E-4,null,"C2",null,1062.2,null,null,"C2",null,2.843E-8,null,"C2",null,9.638E-9]
{"$rows_left_out":8}
{"sheet":"Steam Table","index":6,"n_rows":230,"n_cols":9,"rows_kept":230,"cut":false,"hidden":false,"merged":[[0,1,0,2],[0,4,0,5],[0,7,0,8],[229,1,229,8]]}
[null,"Pressure",null,"Temperature","Specific Volume",null,"Heat -BTU/lb","Enthalpy - BTU/lb"]
[null,"Gage psig","Absolute psia","Saturation Deg. F.","Water vf\nft3/lb","Steam vg\nft3/lb","Liquid hf","Lat. Heat    hfg","Total STM Heat hg"]
[null,0,14.7,212,1.6712999999999999E-2,26.789000000000001,180.33,970,{"$f":"SUM(G3:H3)","v":1150.33}]
[null,1,15.7,215.34,1.6737999999999999E-2,25.190999999999999,183.7,967.9,{"$f":"SUM(G4:H4)","v":1151.5999999999999}]
[null,2,16.7,218.51,1.6761000000000002E-2,23.779,186.89,966,1152.8899999999999]
[null,3,17.7,221.53,1.6784E-2,22.521999999999998,189.93,964.1,1154.03]
[null,4,18.7,224.4,1.6806000000000001E-2,21.393999999999998,192.83,962.3,1155.1299999999999]
[null,5,19.7,227.15,1.6827000000000002E-2,20.378,195.61,960.5,1156.1100000000001]
[null,6,20.7,229.79,1.6847999999999998E-2,19.456,198.28,958.8,1157.08]
[null,7,21.7,232.33,1.6867E-2,18.617000000000001,200.84,957.2,1158.04]
[null,8,22.7,234.77,1.6886000000000002E-2,17.849,203.31,955.6,1158.9100000000001]
[null,9,23.7,237.13,1.6905E-2,17.143999999999998,205.69,954.1,1159.79]
[null,10,24.7,239.4,1.6923000000000001E-2,16.494,207.99,952.6,1160.5900000000001]
[null,11,25.7,241.6,1.6941000000000001E-2,15.891999999999999,210.21,951.2,1161.4100000000001]
[null,12,26.7,243.74,1.6958000000000001E-2,15.335000000000001,212.37,949.8,1162.17]
[null,13,27.7,245.8,1.6974E-2,14.816000000000001,214.46,948.4,1162.8599999999999]
[null,14,28.7,247.81,1.6990999999999999E-2,14.332000000000001,216.5,947,1163.5]
[null,15,29.7,249.76,1.7006E-2,13.88,218.47,945.7,1164.17]
[null,16,30.7,251.66,1.7021999999999999E-2,13.456,220.4,944.5,1164.9000000000001]
[null,17,31.7,253.51,1.7037E-2,13.058,222.27,943.2,1165.47]
{"$rows_left_out":210}